Carbonic acid cyclohexylmethyl ester

Gas phase thermochemistry data

Data compiled by: Hussein Y. Afeefy, Joel F. Liebman, and Stephen E. Stein

Quantity Value Units Method Reference Comment
Δfgas-663.2 ± 4.2kJ/molCcbKiparisova and Rabinovich, 1971

Condensed phase thermochemistry data

Data compiled by: Hussein Y. Afeefy, Joel F. Liebman, and Stephen E. Stein

Quantity Value Units Method Reference Comment
Δfsolid-709. ± 2.kJ/molCcbKiparisova and Rabinovich, 1971
Quantity Value Units Method Reference Comment
Δcsolid-4440. ± 2.kJ/molCcbKiparisova and Rabinovich, 1971Corresponding Δfsolid = -708.8 kJ/mol (simple calculation by NIST; no Washburn corrections)

References

Kiparisova and Rabinovich, 1971
Kiparisova, E.G.; Rabinovich, I.B., Thermochemistry of a series of acyl peroxides, Dokl. Phys. Chem. (Engl. Transl.), 1971, 199, 675-677, In original 1075. [all data]