Poly[imino(1-oxo-1,6-hexanediyl)]

Phase change data

Data compiled by: Eugene S. Domalski and Elizabeth D. Hearing

Enthalpy of fusion

ΔfusH (kcal/mol) Temperature (K) Reference Comment
5.0717498.Marx, Smith, et al., 1955

Entropy of fusion

ΔfusS (cal/mol*K) Temperature (K) Reference Comment
10.18498.Marx, Smith, et al., 1955

References

Marx, Smith, et al., 1955
Marx, P.; Smith, C.W.; Worthington, A.E.; Dole, M., Specific heat of synthetic high polymers: IV. Polycaprolactam, J. Phys. Chem., 1955, 59, 1015-1019. [all data]