Polyvinyltrimethylsilane

Condensed phase thermochemistry data

Data compiled by: Eugene S. Domalski and Elizabeth D. Hearing

Quantity Value Units Method Reference Comment
solid,1 bar189.6J/mol*KN/ALebedev, Lebedev, et al., 1981
solid,1 bar217.6J/mol*KN/ARabinovich, Lebedev, et al., 1975glass phase

Constant pressure heat capacity of solid

Cp,solid (J/mol*K) Temperature (K) Reference Comment
166.5298.15Lebedev, Lebedev, et al., 1981T = 5 to 330 K.
179.9300.Rabinovich, Lebedev, et al., 1975glass phase; T = 50 to 300 K.

References

Lebedev, Lebedev, et al., 1981
Lebedev, B.V.; Lebedev, N.K.; Khotimskii, V.S.; Durgar'yan, S.G.; Nametkin, N.S., Thermodynamics of polymerization of vinylorganosilanes, Dokl. Akad. Nauk, 1981, SSSR 259, 629-633. [all data]

Rabinovich, Lebedev, et al., 1975
Rabinovich, I.B.; Lebedev, B.V.; Tsvetkova, L.Ya.; Nametkin, N.S.; Durgar'yan, S.G.; Khotimskii, V.S.; Kiparisova, Y.G., Thermodynamics of polymerization of vinyltrimethylsilane, Vysokomol. Soedin., 1975, A17, 1421-1425. [all data]