Tricyclo[3.3.0.02,6]octane

Phase change data

Data compiled by: William E. Acree, Jr., James S. Chickos

Quantity Value Units Method Reference Comment
Δvap39.1kJ/molN/ALetcher, Sewry, et al., 1988Based on data from 273. - 343. K.

Enthalpy of vaporization

ΔvapH (kJ/mol) Temperature (K) Reference Comment
40.0273.Letcher, Sewry, et al., 1988Based on data from 273. - 343. K.
38.3323.Letcher, Sewry, et al., 1988Based on data from 273. - 343. K.

Gas phase ion energetics data

Data compiled by: Sharon G. Lias, Rhoda D. Levin, and Sherif A. Kafafi

Ionization energy determinations

IE (eV) Method Reference Comment
9.4PEBischof, Gleiter, et al., 1974
9.78PEBischof, Gleiter, et al., 1974Vertical value

References

Letcher, Sewry, et al., 1988
Letcher, T.M.; Sewry, J.; Orchard, S.W., Vapour pressure and density of tricyclo[3.3.0.02, 6]octane, The Journal of Chemical Thermodynamics, 1988, 20, 9, 1115-1116, https://doi.org/10.1016/0021-9614(88)90119-X . [all data]

Bischof, Gleiter, et al., 1974
Bischof, P.; Gleiter, R.; Kukla, M.J.; Paquette, L.A., The photoelectron spectra of tricyclo[3.3.0.02,6]octene and tricyclo[3.3.0.02,6]octane, J. Electron Spectrosc. Relat. Phenom., 1974, 4, 177. [all data]