3,5-Octadiene

Van Den Dool and Kratz RI, non-polar column, custom temperature program

Data compiled by: NIST Mass Spectrometry Data Center, William E. Wallace, director

Column type Capillary
Active phase DB-5MS
Column length (m) 30.
Carrier gas He
Substrate
Column diameter (mm) 0.25
Phase thickness (μm) 0.25
Program 35C => 120C/min => 60C1.5C/min => 100C => 5C/min => 280C
I 812.
ReferenceTurchini, Giani, et al., 2004
Comment MSDC-RI

References

Turchini, Giani, et al., 2004
Turchini, G.M.; Giani, I.; Caprino, F.; Moretti, V.M.; Valfrè, F., Discrimination of origin of farmed trout by means of biometrical parameters, fillet composition and flavor volatile compounds, Ital. J. Anim. Sci., 2004, 3, 123-140. [all data]