Polytetrahydrofuran

Condensed phase thermochemistry data

Data compiled by: Eugene S. Domalski and Elizabeth D. Hearing

Quantity Value Units Method Reference Comment
solid,1 bar19.85cal/mol*KN/ALebedev and Lityagov, 1977

Constant pressure heat capacity of solid

Cp,solid (cal/mol*K) Temperature (K) Reference Comment
19.43200.Lebedev and Lityagov, 1977T = 5 to 400 K. Transition region at 298.15 K.

Phase change data

Data compiled by: Eugene S. Domalski and Elizabeth D. Hearing

Enthalpy of fusion

ΔfusH (kcal/mol) Temperature (K) Reference Comment
2.6291316.Lebedev and Lityagov, 1977, 2
2.6291316.Lebedev and Lityagov, 1977

Entropy of fusion

ΔfusS (cal/mol*K) Temperature (K) Reference Comment
8.32316.Lebedev and Lityagov, 1977, 2
8.32316.Lebedev and Lityagov, 1977

Temperature of phase transition

Ttrs (K) Initial Phase Final Phase Reference Comment
186.crystaline, IIcrystaline, ILebedev and Lityagov, 1977, 2Glass point.

References

Lebedev and Lityagov, 1977
Lebedev, B.V.; Lityagov, V.Ya., Calorimetric study of tetrahydrofuran and its polymerization in the temperature range 0-400°K, Vysokomol. Soedin., 1977, A19, 2283-2290. [all data]

Lebedev and Lityagov, 1977, 2
Lebedev, B.V.; Lityagov, V.Ya., The difference between the entropies and enthalpies of vitreous and crystalline polytetrahydrofuran at 0 K, Zhur. Fiz. Khim., 1977, 51, 1276. [all data]