2,4,6-Tri-t-butyl-nitrosobenzene

Gas phase thermochemistry data

Data compiled by: Hussein Y. Afeefy, Joel F. Liebman, and Stephen E. Stein

Quantity Value Units Method Reference Comment
Δfgas-117.4 ± 5.4kJ/molCcbAcree, Bott, et al., 1995

Condensed phase thermochemistry data

Data compiled by: Hussein Y. Afeefy, Joel F. Liebman, and Stephen E. Stein

Quantity Value Units Method Reference Comment
Δfsolid-208.4 ± 4.4kJ/molCcbAcree, Bott, et al., 1995
Quantity Value Units Method Reference Comment
Δcsolid-11019.3 ± 3.7kJ/molCcbAcree, Bott, et al., 1995

Phase change data

Data compiled as indicated in comments:
ALS - Hussein Y. Afeefy, Joel F. Liebman, and Stephen E. Stein
AC - William E. Acree, Jr., James S. Chickos

Quantity Value Units Method Reference Comment
Δsub91.0 ± 3.2kJ/molVAcree, Bott, et al., 1995ALS
Δsub91.0 ± 3.2kJ/molCAcree, Bott, et al., 1995AC

Gas phase ion energetics data

Data compiled as indicated in comments:
LBLHLM - Sharon G. Lias, John E. Bartmess, Joel F. Liebman, John L. Holmes, Rhoda D. Levin, and W. Gary Mallard

Ionization energy determinations

IE (eV) Method Reference Comment
8.69PECetinkaya, Lappert, et al., 1983Vertical value; LBLHLM

References

Acree, Bott, et al., 1995
Acree, W.E., Jr.; Bott, S.C.; Tucker, S.A.; Ribeiro da Silva, M.D.M.C.; Matos, M.A.R.; Pilcher, G., Enthalpies of combustion of 2,2'6,6'-tetraethylazobenzene N,N-dioxide, 2,4,6-tri(1,1-dimethylethyl)nitrosobenzene, and 2,4,6-tri(1,1-dimethylethyl)nitrobenzene, J. Chem. Thermodyn., 1995, 27, 1433-1440. [all data]

Cetinkaya, Lappert, et al., 1983
Cetinkaya, B.; Lappert, M.F.; Suffolk, R.J., Photoelectron spectra of some sterically hindered phenols and related compounds, J. Chem. Res. Synop., 1983, 316. [all data]