4-[(4-butylphenyl)azo]phenol

Phase change data

Data compiled by: Thermodynamics Research Center, NIST Boulder Laboratories, Chris Muzny director

Quantity Value Units Method Reference Comment
Tfus352.KN/AJin, Kang, et al., 1990Uncertainty assigned by TRC = 0.1 K

In addition to the Thermodynamics Research Center (TRC) data available from this site, much more physical and chemical property data is available from the following TRC products:

References

Jin, Kang, et al., 1990
Jin, J.-I.; Kang, C.-S.; Chung, B.Y., Importance of molecular geometry in liquid crystal formation-incapability of mesophase-formation by bent dimesogenic and star-shaped trimesogenic compounds, Bull. Korean Chem. Soc., 1990, 11, 3, 245. [all data]