Benzenamine, N,N-dimethyl-4-[(4-nitrophenyl)azo]-

Phase change data

Data compiled by: William E. Acree, Jr., James S. Chickos

Enthalpy of sublimation

ΔsubH (kJ/mol) Temperature (K) Method Reference Comment
134.3 ± 7.5419.MEGreen and Jones, 1967Based on data from 413. - 425. K. See also JONES and KRASKA, 2008.
135.1 ± 0.9421.TEGreen and Jones, 1967Based on data from 414. - 428. K. See also Stephenson and Malanowski, 1987.

References

Green and Jones, 1967
Green, H.S.; Jones, F., Vapour pressures, heats of sublimation and degrees of association of some azo compounds in the vapour phase, Trans. Faraday Soc., 1967, 63, 1612, https://doi.org/10.1039/tf9676301612 . [all data]

JONES and KRASKA, 2008
JONES, F.; KRASKA, J., Vapour-phase Dyeing of Synthetic-polymer Fibres, J Food Science, 2008, 82, 9, 333-338, https://doi.org/10.1111/j.1478-4408.1966.tb02726.x . [all data]

Stephenson and Malanowski, 1987
Stephenson, Richard M.; Malanowski, Stanislaw, Handbook of the Thermodynamics of Organic Compounds, 1987, https://doi.org/10.1007/978-94-009-3173-2 . [all data]