Hexadecanoic acid, 2-methyl-, methyl ester

Kovats' RI, non-polar column, custom temperature program

View large format table.

Column type Active phase I Reference Comment
PackedSE-301944.Ubik, Stránský, et al., 1974He, Gas Chrom Q; Column length: 1.5 m; Program: not specified

References

Ubik, Stránský, et al., 1974
Ubik, K.; Stránský, K.; Streibl, M., Mass Spectrometry and Gas Chromatography of Methyl Esters of Higher Aliphatic Branched Acids and Their α-Hydroxy Derivatives, Collect. Czech. Chem. Commun., 1974, 40, 9, 2826-2837, https://doi.org/10.1135/cccc19752826 . [all data]