4-Amino-3-methylbenzoic acid

Phase change data

Data compiled by: William E. Acree, Jr., James S. Chickos

Quantity Value Units Method Reference Comment
Δsub122.0 ± 2.6kJ/molMEMonte and Hillesheim, 2001Based on data from 367. - 383. K.

Enthalpy of sublimation

ΔsubH (kJ/mol) Temperature (K) Method Reference Comment
119.8 ± 0.7375.MEMonte and Hillesheim, 2001Based on data from 367. - 383. K.

Enthalpy of fusion

ΔfusH (kJ/mol) Temperature (K) Method Reference
21.77439.4DSCMonte and Hillesheim, 2001

References

Monte and Hillesheim, 2001
Monte, Manuel J.S.; Hillesheim, Dorothea M., Thermodynamic study of the sublimation of six aminomethylbenzoic acids, The Journal of Chemical Thermodynamics, 2001, 33, 7, 745-754, https://doi.org/10.1006/jcht.2000.0774 . [all data]