(1S,2E,6E,10R)-3,7,11,11-Tetramethylbicyclo[8.1.0]undeca-2,6-diene

Kovats' RI, non-polar column, temperature ramp

Data compiled by: NIST Mass Spectrometry Data Center, William E. Wallace, director

Column type CapillaryCapillaryCapillaryCapillaryCapillary
Active phase DB-5MSHP-5MSHP-5MSDB-5MSHP-1
Column length (m) 30.30.60.30.60.
Carrier gas HeHeHeHeHe
Substrate
Column diameter (mm) 0.250.250.250.250.25
Phase thickness (μm) 0.250.250.250.250.25
Tstart (C) 60.60.40.60.60.
Tend (C) 180.280.250.280.200.
Heat rate (K/min) 3.2.3.3.4.
Initial hold (min)  8.1. 5.
Final hold (min) 15.30.20.30.25.
I 1488.1495.1518.1470.1502.
ReferenceAngioni, Barra, et al., 2006Hazzit, Baaliouamer, et al., 2006Jalali-Heravi, Zekavat, et al., 2006Marongiu, Porcedda, et al., 2006Meccia G., Rosquete C., et al., 2006
Comment MSDC-RI MSDC-RI MSDC-RI MSDC-RI MSDC-RI
Column type CapillaryCapillaryCapillaryCapillaryCapillary
Active phase HP-5DB-5HP-5MSHP-5MSBP-5
Column length (m) 25.30.30.30.50.
Carrier gas   HeHeHe
Substrate
Column diameter (mm) 0.20.250.250.250.32
Phase thickness (μm) 0.330.250.250.250.25
Tstart (C) 60.40.50.50.50.
Tend (C) 240.210.240.250.260.
Heat rate (K/min) 3.2.3.3.5.
Initial hold (min)  2. 10.2.
Final hold (min)  33. 5.5.
I 1495.1496.1533.1498.1499.
ReferenceOliveira, Leitao, et al., 2006Sylvestre, Pichette, et al., 2006Tepe, Askin Akpulat, et al., 2006Asuming, Beauchamp, et al., 2005Baranauskiene, Venskutonis, et al., 2005
Comment MSDC-RI MSDC-RI MSDC-RI MSDC-RI MSDC-RI
Column type CapillaryCapillaryCapillaryCapillaryCapillary
Active phase DB-5MSDB-5HP-5MSHP-5MSDB-1
Column length (m) 30.30.30.30.50.
Carrier gas HeHeHeHeN2
Substrate
Column diameter (mm) 0.250.250.320.320.25
Phase thickness (μm) 0.250.250.250.250.25
Tstart (C) 60.60.70.70.95.
Tend (C) 240.300.250.250.240.
Heat rate (K/min) 3.5.3.3.4.
Initial hold (min)   5.5.
Final hold (min)
I 1495.1486.1486.1501.1492.
ReferenceMaia, Andrade, et al., 2005Santos, Lopes, et al., 2004Siani, Garrido, et al., 2004Siani, Garrido, et al., 2004Velasco-Negueruela, Sanz, et al., 2004
Comment MSDC-RI MSDC-RI MSDC-RI MSDC-RI MSDC-RI
Column type CapillaryCapillaryCapillaryCapillaryCapillary
Active phase CP Sil 5 CBDB-5HP-5BP-1DB-5
Column length (m) 25.25.30.30.30.
Carrier gas H2HeHeN2He
Substrate
Column diameter (mm) 0.250.220.250.320.26
Phase thickness (μm) 0.150.250.250.250.25
Tstart (C) 50.60.60.60.60.
Tend (C) 230.240.200.220.240.
Heat rate (K/min) 3.3.4.5.3.
Initial hold (min)   1.
Final hold (min)   15.13.
I 1497.1480.1496.1486.1494.
ReferenceOgunwande, Olawore, et al., 2003El-Ghorab, Fadel, et al., 2002Juliani and Simon, 2002Shawl, Srivastava, et al., 2002Adams, 2000
Comment MSDC-RI MSDC-RI MSDC-RI MSDC-RI MSDC-RI
Column type CapillaryCapillaryCapillaryCapillaryCapillary
Active phase SE-30BP-5DB-5CP Sil 5 CBDB-5
Column length (m) 25.25.30.25.30.
Carrier gas HeHeHeHeHe
Substrate
Column diameter (mm) 0.220.250.260.250.25
Phase thickness (μm) 0.250.250.25 0.25
Tstart (C) 70.60.60.60.60.
Tend (C) 220.200.246.280.240.
Heat rate (K/min) 5.3.3.5.3.
Initial hold (min)
Final hold (min)
I 1484.1497.1499.1494.1496.
ReferenceKardali, Velasco-Negueruela, et al., 2000Weissbecker B., Van Loon J.J.A., et al., 2000Adams, 1999Kaul, Gujral, et al., 1999da Silva, Andrade, et al., 1999
Comment MSDC-RI MSDC-RI MSDC-RI MSDC-RI MSDC-RI
Column type CapillaryCapillaryCapillaryCapillaryCapillary
Active phase DB-5BP-1BP-1CP Sil 8 CBDB-5
Column length (m) 30.50.50.25.30.
Carrier gas He  ArHe
Substrate
Column diameter (mm) 0.250.250.250.150.25
Phase thickness (μm) 0.250.250.250.120.25
Tstart (C) 60.60.60.60.60.
Tend (C) 240.260.260.220.240.
Heat rate (K/min) 4.2.2.3.3.
Initial hold (min)
Final hold (min)
I 1497.1498.1500.1493.1495.
Referenceda Silva, Zoghbi, et al., 1999Vera and Chane-Ming, 1999Vera and Chane-Ming, 1999Szafranek, Malinski, et al., 1998Tellez, Estell, et al., 1997
Comment MSDC-RI MSDC-RI MSDC-RI MSDC-RI MSDC-RI
Column type CapillaryCapillaryCapillaryCapillary
Active phase DB-5DB-5DB-5OV-101
Column length (m) 30.30.30.25.
Carrier gas    N2
Substrate
Column diameter (mm)    0.25
Phase thickness (μm)
Tstart (C) 40.40.40.50.
Tend (C) 210.210.210.200.
Heat rate (K/min) 2.2.2.5.
Initial hold (min) 2.2.2.
Final hold (min) 120.120.120.
I 1490.1497.1497.1496.
ReferenceLoayza, Abujder, et al., 1995Loayza, Abujder, et al., 1995Loayza, Abujder, et al., 1995Menut, Molangui, et al., 1995
Comment MSDC-RI MSDC-RI MSDC-RI MSDC-RI

Kovats' RI, non-polar column, isothermal

Data compiled by: NIST Mass Spectrometry Data Center, William E. Wallace, director

Column type CapillaryCapillary
Active phase EC-1OV-101
Column length (m) 30.
Carrier gas
Substrate
Column diameter (mm) 0.25
Phase thickness (μm) 0.25
Temperature (C) 130.130.
I 1475.1485.
ReferenceSzafranek, Chrapkowska, et al., 2005Clarke, Perry, et al., 1994
Comment MSDC-RI MSDC-RI

Normal alkane RI, non-polar column, temperature ramp

Data compiled by: NIST Mass Spectrometry Data Center, William E. Wallace, director

Column type CapillaryCapillaryCapillaryCapillaryCapillary
Active phase HP-5 MSHP-5 MSHP-5MSRTX-1RTX-1
Column length (m) 30.30.30.60.60.
Carrier gas HeliumHeliumHeliumHeliumHelium
Substrate
Column diameter (mm) 0.250.250.250.220.22
Phase thickness (μm) 0.250.250.250.250.25
Tstart (C) 60.60.50.60.60.
Tend (C) 220.220.250.230.230.
Heat rate (K/min) 5.5.7.2.2.
Initial hold (min) 10.10.1.
Final hold (min)   5.30.30.
I 1495.1497.1507.1492.1494.
ReferenceOgunwande, Flamini, et al., 2010Ogunwande, Flamini, et al., 2010Zouari, Zouari, et al., 2010Museli, Pau, et al., 2009Museli, Pau, et al., 2009
Comment MSDC-RI MSDC-RI MSDC-RI MSDC-RI MSDC-RI
Column type CapillaryCapillaryCapillaryCapillaryCapillary
Active phase DB-5DB-5DB-5DB-5 MSHP-5
Column length (m) 30.30.50.30.30.
Carrier gas NitrogenNitrogenNitrogenHeliumHelium
Substrate
Column diameter (mm) 0.250.250.200.250.25
Phase thickness (μm) 0.250.250.320.250.25
Tstart (C) 40.40.60.50.50.
Tend (C) 250.230.220.220.280.
Heat rate (K/min) 3.2.5.3.9.
Initial hold (min) 1. 3.2.3.
Final hold (min) 10. 5.70.3.
I 1500.1500.1500.1492.1495.
ReferenceRahimi-Nasrabadi, Gholivand, et al., 2009Scrivanti, Anton, et al., 2009Shafaghat and Sadeghi, 2009Shimizu, Imayoshi, et al., 2009Aicha, Ines, et al., 2008
Comment MSDC-RI MSDC-RI MSDC-RI MSDC-RI MSDC-RI
Column type CapillaryCapillaryCapillaryCapillaryCapillary
Active phase HP-5 MSDB-5HP-5 MSHP-5HP-5
Column length (m) 30.25.30.30.30.
Carrier gas  NitrogenHeliumHeliumHelium
Substrate
Column diameter (mm) 0.250.220.250.250.32
Phase thickness (μm)  0.250.250.250.25
Tstart (C) 60.50.50.50.100.
Tend (C) 280.300.230.300.240.
Heat rate (K/min) 3.6.54.3.5.
Initial hold (min)  2.4. 2.
Final hold (min)  7.10.30.5.
I 1496.1516.1499.1490.1494.
ReferenceBaziou, Couladis, et al., 2008Chieng, Assim, et al., 2008Forero, Quijano, et al., 2008Isidorov, Lech, et al., 2008Lago, Romoff, et al., 2008
Comment MSDC-RI MSDC-RI MSDC-RI MSDC-RI MSDC-RI
Column type CapillaryCapillaryCapillaryCapillaryCapillary
Active phase SLB-5 MSZB-1RTX-1HP-5 MSRTX-5
Column length (m) 30.30.60.30.20.
Carrier gas HeliumNitrogenHeHeliumHelium
Substrate
Column diameter (mm) 0.250.250.220.250.18
Phase thickness (μm) 0.250.250.250.250.20
Tstart (C) 50.45.60.50.50.
Tend (C) 250.230.230.240.280.
Heat rate (K/min) 3.3.2.3.4.
Initial hold (min) 2.   1.
Final hold (min) 10. 35.
I 1499.1489.1494.1534.1514.
ReferenceLo Presti, Sciarrone, et al., 2008Mierendorff, Stahl-Biskup, et al., 2008Paolini, Tomi, et al., 2008Sarikurkcu, Tepe, et al., 2008Skalicka-Wozniak, Los, et al., 2008
Comment MSDC-RI MSDC-RI MSDC-RI MSDC-RI MSDC-RI
Column type CapillaryCapillaryCapillaryCapillaryCapillary
Active phase HP-5DB-5DB-5MSHP-5MSHP-5 MS
Column length (m) 30.50.30.30.30.
Carrier gas HeliumNitrogenHeHeHelium
Substrate
Column diameter (mm) 0.250.200.250.250.32
Phase thickness (μm) 0.320.320.250.250.25
Tstart (C) 60.60.60.60.60.
Tend (C) 250.220.240.240.280.
Heat rate (K/min) 5.5.3.3.4.
Initial hold (min) 30.3.  5.
Final hold (min)  5.
I 1494.1488.1496.1511.1497.
ReferenceYassa and Akhani, 2008Amiri, 2007Andrade, Oliveira, et al., 2007Argyropoulou, Daferera, et al., 2007Capetanos, Saroglou, et al., 2007
Comment MSDC-RI MSDC-RI MSDC-RI MSDC-RI MSDC-RI
Column type CapillaryCapillaryCapillaryCapillaryCapillary
Active phase RTX-5 MSHP-5HP-5MSHP-5MSCol-Elite 5MS
Column length (m) 30.30.30.30.30.
Carrier gas HeHeliumHeHeHe
Substrate
Column diameter (mm) 0.250.250.250.250.25
Phase thickness (μm) 0.250.260.250.250.25
Tstart (C) 60.60.60.60.30.
Tend (C) 200.240.250.250.246.
Heat rate (K/min) 2.4.2.2.3.
Initial hold (min) 2.2.8.8.
Final hold (min) 10.20.15.15.
I 1487.1500.1491.1492.1508.
ReferenceEdris, Chizzola, et al., 2007Farsam, Amanlou, et al., 2007Ferhat, Meklati, et al., 2007Ferhat, Tigrine-Kordjani, et al., 2007Gudaityte and Venskutonis R.P., 2007
Comment MSDC-RI MSDC-RI MSDC-RI MSDC-RI MSDC-RI
Column type CapillaryCapillaryCapillaryCapillaryCapillary
Active phase HP-1DBP-5BP-1DB-5AT-5
Column length (m) 30.25. 30.60.
Carrier gas HeHeliumHeHeHelium
Substrate
Column diameter (mm) 0.250.25 0.250.25
Phase thickness (μm) 0.250.22 0.250.25
Tstart (C) 60.40.60.60.60.
Tend (C) 240.250.220.300.260.
Heat rate (K/min) 2.3.5.3.4.
Initial hold (min)  1.
Final hold (min) 20.10.6.
I 1478.1471.1493.1487.1501.
ReferenceHachicha, Skanji, et al., 2007Heravi and Sereshti, 2007Kiran, Devi, et al., 2007Limberger, Scopel, et al., 2007Meccia, Rojas, et al., 2007
Comment MSDC-RI MSDC-RI MSDC-RI MSDC-RI MSDC-RI
Column type CapillaryCapillaryCapillaryCapillaryCapillary
Active phase DB-1Methyl SiliconeSPB-5HP-5HP-5 MS
Column length (m) 30.50.30.30.60.
Carrier gas HeliumHeliumHeHeliumHydrogen
Substrate
Column diameter (mm) 0.250.250.250.250.25
Phase thickness (μm) 0.25 0.250.250.25
Tstart (C) 50.50.50.40.60.
Tend (C) 260.240.250.260.260.
Heat rate (K/min) 2.53.2.4.4.
Initial hold (min) 1.
Final hold (min) 20.   20.
I 1474.1500.1502.1491.1500.
ReferenceMonser-Esfahani, Karamkhani, et al., 2007Ozcan and Chalchat, 2007Raal, Orav, et al., 2007Ristic, Krivokuca-Dokic, et al., 2007Rojas, Velasco, et al., 2007
Comment MSDC-RI MSDC-RI MSDC-RI MSDC-RI MSDC-RI
Column type CapillaryCapillaryCapillaryCapillaryCapillary
Active phase DBP-5DB-1DB-5DB-5Elite-5MS
Column length (m) 25.60.30.30.30.
Carrier gas HeliumNitrogen  He
Substrate
Column diameter (mm) 0.250.250.250.250.32
Phase thickness (μm) 0.220.250.250.250.5
Tstart (C) 40.60.40.40.40.
Tend (C) 250.250.210.250.280.
Heat rate (K/min) 3.5.2.2.4.
Initial hold (min) 1.   5.
Final hold (min) 10.10.33.33.10.
I 1471.1505.1498.1498.1499.
ReferenceSereshti and Samadi, 2007Sonboli, Kanani, et al., 2007Sylvestre, Longtin, et al., 2007Sylvestre, Pichette, et al., 2007Tava, Pecetti, et al., 2007
Comment MSDC-RI MSDC-RI MSDC-RI MSDC-RI MSDC-RI
Column type CapillaryCapillaryCapillaryCapillaryCapillary
Active phase HP-5MSHP-5DB-5DB-5DB-5
Column length (m) 30.30.30.30.30.
Carrier gas HeHeHe He
Substrate
Column diameter (mm) 0.250.250.250.250.25
Phase thickness (μm) 0.250.320.250.250.25
Tstart (C) 60.60.60.60.40.
Tend (C) 280.250.300.300.260.
Heat rate (K/min) 3.5.3.3.4.
Initial hold (min)  30.  5.
Final hold (min)
I 1455.1494.1488.1491.1492.
ReferenceTzakou, Bazos, et al., 2007Yassa and Akhani, 2007Apel, Sobral, et al., 2006Apel, Sobral, et al., 2006, 2Askari and Sefidkon, 2006
Comment MSDC-RI MSDC-RI MSDC-RI MSDC-RI MSDC-RI
Column type CapillaryCapillaryCapillaryCapillaryCapillary
Active phase CP Sil 5 CBBP-1HP-5MSBP-1BP-1
Column length (m) 25.50.30.50.50.
Carrier gas He  HeHe
Substrate
Column diameter (mm)  0.220.250.220.22
Phase thickness (μm)  0.250.250.250.25
Tstart (C) 80.60.60.60.60.
Tend (C) 270.220.280.220.220.
Heat rate (K/min) 10.2.4.2.2.
Initial hold (min)
Final hold (min)  20. 20.20.
I 1494.1494.1491.1494.1494.
ReferenceAyoub, Al-Azizi, et al., 2006Boti, Yao, et al., 2006Ebrahim Sajjadi and Mehregan, 2006Fanciullino, Tomi, et al., 2006Fanciullino, Tomi, et al., 2006
Comment MSDC-RI MSDC-RI MSDC-RI MSDC-RI MSDC-RI
Column type CapillaryCapillaryCapillaryCapillaryCapillary
Active phase HP-5HP-1DB-5DB-1DB-5
Column length (m) 30.50.30.60.30.
Carrier gas HeHe  He
Substrate
Column diameter (mm) 0.250.20.250.250.25
Phase thickness (μm) 0.250.330.250.250.25
Tstart (C) 50.60.40.60.50.
Tend (C) 300.250.210.250.250.
Heat rate (K/min) 5.2.2.5.3.
Initial hold (min) 5. 2.
Final hold (min) 5.40.33.10.10.
I 1496.1488.1498.1500.1491.
ReferenceFiguérédo, Cabassu, et al., 2006Filippi, Lanfranchi, et al., 2006Garneau F.X., Collin G., et al., 2006Hadian, Sonboli, et al., 2006Havlik, Kokoska, et al., 2006
Comment MSDC-RI MSDC-RI MSDC-RI MSDC-RI MSDC-RI
Column type CapillaryCapillaryCapillaryCapillaryCapillary
Active phase HP-5HP-5MSHP-5MSBP-1HP-5
Column length (m) 30.30.30. 30.
Carrier gas HeHeHeHeliumHelium
Substrate
Column diameter (mm) 0.250.250.25 0.32
Phase thickness (μm) 0.250.250.25 0.25
Tstart (C) 60.60.50.60.60.
Tend (C) 240.260.280.220.260.
Heat rate (K/min) 4.4.5.5.5.
Initial hold (min)   4. 2.
Final hold (min)   10.6.13.
I 1495.1498.1499.1493.1497.
ReferenceIbañez and Usubillaga, 2006Ibanez and Usubillaga, 2006Kim, El-Aty, et al., 2006Kiran, Bhavani, et al., 2006Kucuk, Gulec, et al., 2006
Comment MSDC-RI MSDC-RI MSDC-RI MSDC-RI MSDC-RI
Column type CapillaryCapillaryCapillaryCapillaryCapillary
Active phase RTX-1HP-5CP Sil 5 CBCP Sil 5 CB5 % Phenyl methyl siloxane
Column length (m) 30.30.30.30.30.
Carrier gas HeHeN2N2Helium
Substrate
Column diameter (mm) 0.320.250.320.250.25
Phase thickness (μm) 0.250.250.250.250.25
Tstart (C) 60.100.50.50.60.
Tend (C) 300.240.300.200.280.
Heat rate (K/min) 4.5.4.5.3.
Initial hold (min)  2.
Final hold (min)  5.  30.
I 1489.1496.1486.1497.1470.
ReferenceKula, Izydorczyk, et al., 2006Lago, Soares, et al., 2006Lis and Milczarek, 2006Martin, Joseph, et al., 2006Marongiu, Piras, et al., 2006
Comment MSDC-RI MSDC-RI MSDC-RI MSDC-RI MSDC-RI
Column type CapillaryCapillaryCapillaryCapillaryCapillary
Active phase DB-5DB-5DB-5DB-5DB-1
Column length (m) 30.30.30.25.50.
Carrier gas HeHeHeN2N2
Substrate
Column diameter (mm) 0.250.250.250.250.25
Phase thickness (μm) 0.250.250.250.150.25
Tstart (C) 60.60.60.50.95.
Tend (C) 220.220.220.200.240.
Heat rate (K/min) 4.4.4.4.4.
Initial hold (min)  5.5.3.
Final hold (min)
I 1498.1502.1501.1500.1494.
ReferenceMorteza-Semnani, Akbarzadeh, et al., 2006Morteza-Semnani K., Akbarzadeh M., et al., 2006Morteza-Semnani K., Saeedi M., et al., 2006Ouamba, Ouabonzi, et al., 2006Pala-Paul J., Perez-Alonso M.J., et al., 2006
Comment MSDC-RI MSDC-RI MSDC-RI MSDC-RI MSDC-RI
Column type CapillaryCapillaryCapillaryCapillaryCapillary
Active phase HP-5DB-5HP-5HP-5MSHP-5MS
Column length (m) 30.30.25.30.30.
Carrier gas HeHydrogenH2 He
Substrate
Column diameter (mm) 0.250.250.320.250.25
Phase thickness (μm) 0.250.250.250.250.25
Tstart (C) 60.70.60.50.60.
Tend (C) 220.280.240.250.280.
Heat rate (K/min) 5.4.3.10.4.
Initial hold (min) 10.4. 5.
Final hold (min)
I 1495.1494.1499.1507.1496.
ReferencePintore G., Chessa M., et al., 2006Pino, Marbot, et al., 2006Potzernheim, Bizzo, et al., 2006Robinson, 2006Sajjadi, 2006
Comment MSDC-RI MSDC-RI MSDC-RI MSDC-RI MSDC-RI
Column type CapillaryCapillaryCapillaryCapillaryCapillary
Active phase DB-5DB-5DB-1DB-5DB-1
Column length (m) 30.30.60.30.60.
Carrier gas HeHeHeHeHelium
Substrate
Column diameter (mm) 0.250.250.250.250.25
Phase thickness (μm) 0.250.25 0.250.25
Tstart (C) 50.50.40.40.60.
Tend (C) 240.240.250.260.250.
Heat rate (K/min) 4.4.4.2.5.
Initial hold (min)    5.
Final hold (min)    20.10.
I 1488.1489.1490.1486.1491.
ReferenceSefidkon, Abbasi, et al., 2006Sefidkon, Abbasi, et al., 2006Sefidkon, Jamzad, et al., 2006Senatore, Landolfi, et al., 2006Sonboli, Mirjalili, et al., 2006
Comment MSDC-RI MSDC-RI MSDC-RI MSDC-RI MSDC-RI
Column type CapillaryCapillaryCapillaryCapillaryCapillary
Active phase CP Sil 5 CBCP Sil 5 CBMethyl SiliconeHP-5MSDB-5
Column length (m) 25.25.25.30.30.
Carrier gas H2 N2HeHe
Substrate
Column diameter (mm) 0.250.250.30.250.25
Phase thickness (μm)   0.150.250.25
Tstart (C) 50.50.50.60.60.
Tend (C) 230.230.210.275.210.
Heat rate (K/min) 3.3.2.4.3.
Initial hold (min)   5. 5.
Final hold (min)
I 1495.1495.1517.1499.1492.
ReferenceTesso, König, et al., 2006Tesso, Kubeczka, et al., 2006Tonzibo, Coffy, et al., 2006Asadipour, Mehrabani, et al., 2005Askari and Sefidkon, 2005
Comment MSDC-RI MSDC-RI MSDC-RI MSDC-RI MSDC-RI
Column type CapillaryCapillaryCapillaryCapillaryCapillary
Active phase HP-5MSDB-5MSDB-5HP-5DB-5
Column length (m) 30.30.50.25.30.
Carrier gas HeHe HeHe
Substrate
Column diameter (mm) 0.250.250.30.20.25
Phase thickness (μm) 0.250.250.250.330.25
Tstart (C) 60.60.60.60.60.
Tend (C) 280.240.240.240.300.
Heat rate (K/min) 3.3.2.3.3.
Initial hold (min)     3.
Final hold (min)    7.
I 1471.1495.1495.1492.1494.
ReferenceBasta, Tzakou, et al., 2005Busman, Zoghbi, et al., 2005Chagonda and Chalchat, 2005Duarte, Figueira, et al., 2005Ferraz, Limberger, et al., 2005
Comment MSDC-RI MSDC-RI MSDC-RI MSDC-RI MSDC-RI
Column type CapillaryCapillaryCapillaryCapillaryCapillary
Active phase HP-5HP-5MSCP Sil 5 CBCP Sil 5 CBHP-5
Column length (m) 30.30.30.30.25.
Carrier gas HeHeN2N2H2
Substrate
Column diameter (mm) 0.250.250.250.250.32
Phase thickness (μm) 0.250.250.250.250.52
Tstart (C) 50.60.60.60.40.
Tend (C) 300.300.250.250.240.
Heat rate (K/min) 5.3.5.5.4.
Initial hold (min) 5.
Final hold (min) 5. 10.10.
I 1496.1491.1504.1506.1492.
ReferenceFiguérédo, Cabassu, et al., 2005Grombone-Guaratini, Silva-Brandão, et al., 2005Jassbi, Mehrdad, et al., 2005Jassbi, Mehrdad, et al., 2005Jovanovic, Kitic, et al., 2005
Comment MSDC-RI MSDC-RI MSDC-RI MSDC-RI MSDC-RI
Column type CapillaryCapillaryCapillaryCapillaryCapillary
Active phase DB-1DB-5DB-5DB-5DB-5
Column length (m) 30.30.30.30.30.
Carrier gas HeHeHeHeHe
Substrate
Column diameter (mm) 0.250.250.250.250.25
Phase thickness (μm) 0.250.250.250.250.25
Tstart (C) 50.60.60.60.60.
Tend (C) 265.230.220.220.220.
Heat rate (K/min) 2.53.4.4.4.
Initial hold (min) 1. 5.5.4.
Final hold (min) 20.
I 1475.1492.1500.1500.1501.
ReferenceKhanavi, Ghasemian, et al., 2005Limberger, Sobral, et al., 2005Morteza-Semnani, Akbarzadeh, et al., 2005Morteza-Semnani, Akbarzadeh, et al., 2005, 2Morteza-Semnani and Saeedi, 2005
Comment MSDC-RI MSDC-RI MSDC-RI MSDC-RI MSDC-RI
Column type CapillaryCapillaryCapillaryCapillaryCapillary
Active phase CP Sil 5 CBHP-5DB-1DB-1HP-5MS
Column length (m) 25.30.50.50.30.
Carrier gas  HeN2N2
Substrate
Column diameter (mm) 0.250.250.250.250.2
Phase thickness (μm) 0.150.250.250.25
Tstart (C) 50.70.95.95.60.
Tend (C) 230.240.240.240.280.
Heat rate (K/min) 3.5.4.4.3.
Initial hold (min)
Final hold (min)
I 1497.1502.1493.1493.1500.
ReferenceOlawore, Ogunwande, et al., 2005Oyedeji, Yani, et al., 2005Palá-Paúl, Pérez-Alonso, et al., 2005Pala-Paul, Perez-Alonso, et al., 2005Petrakis, Roussis, et al., 2005
Comment MSDC-RI MSDC-RI MSDC-RI MSDC-RI MSDC-RI
Column type CapillaryCapillaryCapillaryCapillaryCapillary
Active phase HP-5MSHP-5MSHP-5MSDB-1DB-5
Column length (m) 30.30.30.30.30.
Carrier gas HeHeHeHeHe
Substrate
Column diameter (mm) 0.250.250.250.250.25
Phase thickness (μm) 0.250.250.250.25
Tstart (C) 60.60.60.50.40.
Tend (C) 220.280.275.265.240.
Heat rate (K/min) 6.4.4.2.54.
Initial hold (min) 3.  1.
Final hold (min)    20.
I 1513.1493.1494.1475.1493.
ReferenceSafaei-Ghomi, Bamoniri, et al., 2005Sajjadi S.E. and Eskandari B., 2005Sajjadi and Ghannadi, 2005Sarkhail, Amin, et al., 2005Sefidkon and Jamzad, 2005
Comment MSDC-RI MSDC-RI MSDC-RI MSDC-RI MSDC-RI
Column type CapillaryCapillaryCapillaryCapillaryCapillary
Active phase HP-5MSDB-5DB-5HP-5MSRTX-1
Column length (m) 30.30.30.30.60.
Carrier gas HeHeHeHeHe
Substrate
Column diameter (mm) 0.250.250.250.250.25
Phase thickness (μm) 0.250.250.250.250.25
Tstart (C) 60.60.60.60.60.
Tend (C) 280.300.230.280.25.
Heat rate (K/min) 3.3.3.3.5.
Initial hold (min) 5.
Final hold (min)   20. 10.
I 1497.1490.1500.1489.1500.
ReferenceSetzer, Noletto, et al., 2005Simoes-Pires C.A., Debenedetti S., et al., 2005Skoula and Grayer, 2005Slavkovska, Couladis, et al., 2005Sonboli, Salehi, et al., 2005
Comment MSDC-RI MSDC-RI MSDC-RI MSDC-RI MSDC-RI
Column type CapillaryCapillaryCapillaryCapillaryCapillary
Active phase DB-1RTX-5HP-5MSDB-5HP-5 MS
Column length (m) 60.30.30.30.30.
Carrier gas He HeHeHelium
Substrate
Column diameter (mm) 0.250.250.250.320.25
Phase thickness (μm) 0.250.250.250.250.25
Tstart (C) 60.60.60.60.60.
Tend (C) 250.220.280.280.240.
Heat rate (K/min) 5.3.3.3.3.
Initial hold (min)
Final hold (min) 10.
I 1496.1493.1453.1467.1500.
ReferenceSonboli, Salehi, et al., 2005, 2Szafranek, Chrapkowska, et al., 2005Tzakou, Bazos, et al., 2005Tzakou and Constantinidis, 2005Urdampilleta, Amat, et al., 2005
Comment MSDC-RI MSDC-RI MSDC-RI MSDC-RI MSDC-RI
Column type CapillaryCapillaryCapillaryCapillaryCapillary
Active phase CP Sil 5 CBDB-5DB-5RTX-1SE-54
Column length (m) 30.25.60.30.30.
Carrier gas N2NitrogenHeN2He
Substrate
Column diameter (mm) 0.250.250.250.250.25
Phase thickness (μm) 0.250.250.250.250.25
Tstart (C) 50.60.40.60.60.
Tend (C) 200.240.280.300.260.
Heat rate (K/min) 5.3.4.4.2.
Initial hold (min)   4. 5.
Final hold (min)
I 1493.1498.1494.1493.1486.
ReferenceAgnaniet, Menut, et al., 2004JAvidnia, Mojab, et al., 2004Kalvandi, Sefidkon, et al., 2004Kalemba and Thiem, 2004Kilic, Hafizoglu, et al., 2004
Comment MSDC-RI MSDC-RI MSDC-RI MSDC-RI MSDC-RI
Column type CapillaryCapillaryCapillaryCapillaryCapillary
Active phase DB-5DB-5RTX-1DB-5DB-5MS
Column length (m) 30.30.30.30.30.
Carrier gas HeHeN2 He
Substrate
Column diameter (mm) 0.250.250.320.250.25
Phase thickness (μm) 0.250.250.250.250.25
Tstart (C) 60.60.60.40.60.
Tend (C) 300.300.300.210.280.
Heat rate (K/min) 3.3.4.2.3.
Initial hold (min)    2.
Final hold (min)    33.30.
I 1471.1489.1492.1499.1459.
ReferenceLago, de Ávila, et al., 2004Limberger, Sobral, et al., 2004Lis, Boczek, et al., 2004Lopez Arze, Collin, et al., 2004Marongiu, Porcedda, et al., 2004
Comment MSDC-RI MSDC-RI MSDC-RI MSDC-RI MSDC-RI
Column type CapillaryCapillaryCapillaryCapillaryCapillary
Active phase HP-5MSDB-1DB-1NB-30HP-5MS
Column length (m) 30.60.50.50.30.
Carrier gas HeHeHeHeHe
Substrate
Column diameter (mm) 0.250.250.220.200.25
Phase thickness (μm) 0.250.250.250.250.25
Tstart (C) 60.50.70.50.60.
Tend (C) 275.270.220.250.280.
Heat rate (K/min) 4.4.4.2.4.
Initial hold (min)
Final hold (min)
I 1498.1492.1492.1489.1492.
ReferenceMehrabani, Asadipour, et al., 2004Nik, Mirza, et al., 2004Palá-Paúl, García-Jiménez, et al., 2004Raal, Paaver, et al., 2004Sajjadi and Shahpiri, 2004
Comment MSDC-RI MSDC-RI MSDC-RI MSDC-RI MSDC-RI
Column type CapillaryCapillaryCapillaryCapillaryCapillary
Active phase DB-1DB-5DB-5DB-5CP Sil 5 CB
Column length (m) 30.30.30.30.20.
Carrier gas HeHe HeHe
Substrate
Column diameter (mm) 0.250.250.250.250.25
Phase thickness (μm) 0.250.250.250.250.25
Tstart (C) 50.40.60.60.100.
Tend (C) 265.250.300.240.270.
Heat rate (K/min) 2.52.3.3.8.
Initial hold (min) 1.5.  2.
Final hold (min) 20.20.
I 1475.1492.1490.1490.1476.
ReferenceSarkhail, Amin, et al., 2004Senatore, Rigano, et al., 2004Suyenaga, Apel, et al., 2004Tellez, Khan, et al., 2004Thappa, Bakshi, et al., 2004
Comment MSDC-RI MSDC-RI MSDC-RI MSDC-RI MSDC-RI
Column type CapillaryCapillaryCapillaryCapillaryCapillary
Active phase DB-5BPX-5HP-5HP-5HP-5MS
Column length (m) 30.25.30.30.30.
Carrier gas HeHeN2HeHe
Substrate
Column diameter (mm) 0.250.220.250.320.25
Phase thickness (μm) 0.251.0.250.250.25
Tstart (C) 60.60.60.100.60.
Tend (C) 300.250.220.240.280.
Heat rate (K/min) 3.3.5.5.3.
Initial hold (min)  5.10.2.
Final hold (min)  10. 5.
I 1500.1519.1492.1496.1494.
ReferenceTirillini, Pellegrino, et al., 2004Vilaseca, Guy, et al., 2004Bertoli, Menichini, et al., 2003Chaves, Lago, et al., 2003Couladis, Özcan, et al., 2003
Comment MSDC-RI MSDC-RI MSDC-RI MSDC-RI MSDC-RI
Column type CapillaryCapillaryCapillaryCapillaryCapillary
Active phase DB-1RTX-5SilHP-5MSDB-1HP-5MS
Column length (m) 60.30.30.30.30.
Carrier gas HeHeHeN2He
Substrate
Column diameter (mm) 0.250.250.250.250.25
Phase thickness (μm)  0.250.250.250.25
Tstart (C) 50.70.60.50.60.
Tend (C) 250.200.220.200.275.
Heat rate (K/min) 4.4.5.5.4.
Initial hold (min)   20.
Final hold (min)  10.20.
I 1487.1494.1501.1494.1495.
ReferenceDabiri and Sefidkon, 2003Dudai, Larkov, et al., 2003Feizbaksh, Saber Tehrani, et al., 2003Fekam Boyom, Ngouana, et al., 2003Ghannadi, Aghazari, et al., 2003
Comment MSDC-RI MSDC-RI MSDC-RI MSDC-RI MSDC-RI
Column type CapillaryCapillaryCapillaryCapillaryCapillary
Active phase HP-5MSRSL-200CP Sil 5 CBDB-5DB-5
Column length (m) 30.30.25.30.30.
Carrier gas HeH2HeHeHe
Substrate
Column diameter (mm) 0.250.320.250.250.25
Phase thickness (μm) 0.250.250.250.250.25
Tstart (C) 60.40.35.60.60.
Tend (C) 280.280.280.280.250.
Heat rate (K/min) 4.6.5.5.3.
Initial hold (min)  5.2.5
Final hold (min)  5.
I 1494.1495.1487.1489.1494.
ReferenceGhasemi, Asghari, et al., 2003Jirovetz, Buchbauer, et al., 2003Kanjilal, Kotoky, et al., 2003Lago, de Ávila, et al., 2003Limberger, Simões-Pires, et al., 2003
Comment MSDC-RI MSDC-RI MSDC-RI MSDC-RI MSDC-RI
Column type CapillaryCapillaryCapillaryCapillaryCapillary
Active phase DB-5MSDB-5CP Sil 5 CBZB-1DB-1
Column length (m) 30.50.25.30.60.
Carrier gas HeHe N2He
Substrate
Column diameter (mm) 0.250.20.250.250.25
Phase thickness (μm) 0.250.250.390.250.25
Tstart (C) 60.50.60.45.50.
Tend (C) 240.220.220.230.270.
Heat rate (K/min) 3.3.5.3.4.
Initial hold (min)  2.
Final hold (min)
I 1494.1499.1495.1489.1484.
ReferenceMaia, Taveira, et al., 2003Masotti, Juteau, et al., 2003Mazloomifar, Saber-Tehrani, et al., 2003Mierendorff, Stahl-Biskup, et al., 2003Mirza and Nik, 2003
Comment MSDC-RI MSDC-RI MSDC-RI MSDC-RI MSDC-RI
Column type CapillaryCapillaryCapillaryCapillaryCapillary
Active phase DB-1CP Sil 5 CBDB-1DB-5DB-5
Column length (m) 60.25.50.30.30.
Carrier gas HeH2N2H2H2
Substrate
Column diameter (mm) 0.250.250.250.250.25
Phase thickness (μm) 0.250.150.250.250.25
Tstart (C) 50.50.95.60.60.
Tend (C) 270.230.240.280.280.
Heat rate (K/min) 4.3.4.4.4.
Initial hold (min)    10.10.
Final hold (min)    40.40.
I 1491.1480.1490.1494.1494.
ReferenceMirza, Nik, et al., 2003Oyedeji, Ekundayo, et al., 2003Perez-Alonso, Velasco-Negueruela, et al., 2003Pino, Marbot, et al., 2003Pino, Marbot, et al., 2003
Comment MSDC-RI MSDC-RI MSDC-RI MSDC-RI MSDC-RI
Column type CapillaryCapillaryCapillaryCapillaryCapillary
Active phase HP-5DB-5NB-30HP-5Methyl Silicone
Column length (m) 30.30.50.30.
Carrier gas HeHeHeHeHe
Substrate
Column diameter (mm) 0.250.20.20.25
Phase thickness (μm) 0.250.250.50.25
Tstart (C) 60.75.50.60.35.
Tend (C) 280.220.250.280.180.
Heat rate (K/min) 3.3.2.4.4.
Initial hold (min)  4.
Final hold (min)
I 1476.1490.1485.1496.1488.
ReferencePitarokili, Tzakou, et al., 2003Priestap, van Baren, et al., 2003Raal, Arak, et al., 2003Sajjadi and Mehregan, 2003Santos and Cordeiro, 2003
Comment MSDC-RI MSDC-RI MSDC-RI MSDC-RI MSDC-RI
Column type CapillaryCapillaryCapillaryCapillaryCapillary
Active phase DB-5HP-5DB-5DB-1DB-1
Column length (m) 30.60.30.60.60.
Carrier gas   HeHeHe
Substrate
Column diameter (mm) 0.250.250.250.250.25
Phase thickness (μm) 0.250.250.250.250.25
Tstart (C) 40.40.60.50.60.
Tend (C) 260.250.240.280.220.
Heat rate (K/min) 2.5.3.4.4.
Initial hold (min) 5.15.
Final hold (min)
I 1483.1494.1497.1488.1488.
ReferenceSenatore and Bruno, 2003Stashenko, Jaramillo, et al., 2003Zoghbi, Andrade, et al., 2003Ahmadi, Mirza, et al., 2002Baher, Mirza, et al., 2002
Comment MSDC-RI MSDC-RI MSDC-RI MSDC-RI MSDC-RI
Column type CapillaryCapillaryCapillaryCapillaryCapillary
Active phase DB-5OV-1015 % Phenyl methyl siloxaneBPX-5DB-5
Column length (m) 30.25.30. 30.
Carrier gas He He He
Substrate
Column diameter (mm) 0.2490.320.25 0.25
Phase thickness (μm) 0.25 0.25 0.25
Tstart (C) 60.50.75.40.60.
Tend (C) 300.200.200.260.240.
Heat rate (K/min) 3.5.3.5.3.
Initial hold (min)   4.
Final hold (min) 5. 8.
I 1494.1498.1500.1510.1496.
ReferenceBos, Koulman, et al., 2002Boyom, Keumedjio, et al., 2002Cicció and Gómez-Laurito, 2002Diaz and Kite, 2002Flamini, Ertugrul, et al., 2002
Comment MSDC-RI MSDC-RI MSDC-RI MSDC-RI MSDC-RI
Column type CapillaryCapillaryCapillaryCapillaryCapillary
Active phase SE-30RSL-200DB-5OV-101DB-5
Column length (m) 50.30.30.25.30.
Carrier gas HeH2HeHeHe
Substrate
Column diameter (mm) 0.250.320.250.320.25
Phase thickness (μm) 0.250.250.25 0.25
Tstart (C) 70.40.60.50.60.
Tend (C) 240.280.240.200.250.
Heat rate (K/min) 4.6.3.5.3.
Initial hold (min)  5.
Final hold (min)  5.
I 1498.1517.1495.1490.1492.
ReferenceIñigo, Palá-Paúl, et al., 2002Jirovetz, Buchbauer, et al., 2002Kobaisy, Tellez, et al., 2002Kuiate, Bessière, et al., 2002Limberger, Simões-Pires, et al., 2002
Comment MSDC-RI MSDC-RI MSDC-RI MSDC-RI MSDC-RI
Column type CapillaryCapillaryCapillaryCapillaryCapillary
Active phase HP-5DB-5DB-5MSHP-5HP-5
Column length (m) 30.30.30.30.30.
Carrier gas  HeHe
Substrate
Column diameter (mm) 0.250.250.250.250.25
Phase thickness (μm) 0.250.250.250.250.25
Tstart (C) 60.60.60.60.60.
Tend (C) 275.240.240.240.240.
Heat rate (K/min) 4.3.3.3.3.
Initial hold (min) 4.
Final hold (min)
I 1487.1496.1496.1501.1517.
ReferenceLockwood, Asghari, et al., 2002Maia, da Silva, et al., 2002Maia, Zoghbi, et al., 2002Novak, Langbehn, et al., 2002Novak, Langbehn, et al., 2002
Comment MSDC-RI MSDC-RI MSDC-RI MSDC-RI MSDC-RI
Column type CapillaryCapillaryCapillaryCapillaryCapillary
Active phase OV-101DB-1HP-1DB-5DB-1
Column length (m) 50.50.50.25.60.
Carrier gas HeN2N2HeHe
Substrate
Column diameter (mm) 0.20.250.250.20.25
Phase thickness (μm) 0.50.250.25
Tstart (C) 50.80.90.60.40.
Tend (C) 250.225.220.220.250.
Heat rate (K/min) 2.4.3.3.4.
Initial hold (min)
Final hold (min)
I 1482.1483.1491.1499.1484.
ReferenceOrav, Kailas, et al., 2002Palá-Paúl, Pérez-Alonso, et al., 2002Priestap, van Baren, et al., 2002Schwob, Bessière, et al., 2002Sefidkon, Dabiri, et al., 2002
Comment MSDC-RI MSDC-RI MSDC-RI MSDC-RI MSDC-RI
Column type CapillaryCapillaryCapillaryCapillaryCapillary
Active phase DB-1DB-5MSDB-5DB-1SPB-5
Column length (m) 60.30.30.60.60.
Carrier gas HeHeHeN2He
Substrate
Column diameter (mm) 0.250.250.250.2480.32
Phase thickness (μm) 0.250.250.250.25
Tstart (C) 40.60.60.60.40.
Tend (C) 280.270.240.220.220.
Heat rate (K/min) 4.3.3.3.3.
Initial hold (min) 5.  5.5.
Final hold (min)    22.15.
I 1491.1496.1497.1501.1500.
ReferenceSefidkon, 2002Zoghbi, Andrade, et al., 2002Zoghbi, Andrade, et al., 2002, 2Bailac, Dellacasa, et al., 2001Cornu, Carnat, et al., 2001
Comment MSDC-RI MSDC-RI MSDC-RI MSDC-RI MSDC-RI
Column type CapillaryCapillaryCapillaryCapillaryCapillary
Active phase OV-1HP-5Optima-5RTX-1BP-1
Column length (m) 30.30.30.30.50.
Carrier gas H2N2HeN2He
Substrate
Column diameter (mm) 0.320.250.20.250.22
Phase thickness (μm) 0.30.25 0.250.25
Tstart (C) 50.60.50.60.60.
Tend (C) 250.220.250.300.230.
Heat rate (K/min) 3.5.3.4.2.
Initial hold (min) 1.10.3.
Final hold (min) 20.   35.
I 1476.1495.1497.1494.1494.
ReferenceGallori, Bilia, et al., 2001Gallori, Flamini, et al., 2001Jacquemond-Collet, Bessière, et al., 2001Kalemba, Marschall, et al., 2001Lota, de Rocca Serra, et al., 2001
Comment MSDC-RI MSDC-RI MSDC-RI MSDC-RI MSDC-RI
Column type CapillaryCapillaryCapillaryCapillaryCapillary
Active phase DB-1DB-1DB-1DB-5DB-1
Column length (m) 60.30.30.30.60.
Carrier gas HeN2HeHeN2
Substrate
Column diameter (mm) 0.250.250.20.250.25
Phase thickness (μm) 0.250.25 0.250.25
Tstart (C) 50.80.60.60.60.
Tend (C) 270.225.240.240.220.
Heat rate (K/min) 4.4.3.3.3.
Initial hold (min)     5.
Final hold (min)     22.
I 1486.1473.1501.51494.1512.
ReferenceMirza, Ahmadi, et al., 2001Palá-Paúl, Pérez-Alonso, et al., 2001Santos, Moreira, et al., 2001Tellez M., Estell R., et al., 2001Bailac, Dellacasa, et al., 2000
Comment MSDC-RI MSDC-RI MSDC-RI MSDC-RI MSDC-RI
Column type CapillaryCapillaryCapillaryCapillaryCapillary
Active phase HP-1BP-1HP-5OV-101DB-1
Column length (m) 60.25.30.25.60.
Carrier gas HeN2HeN2N2
Substrate
Column diameter (mm) 0.250.330.250.250.25
Phase thickness (μm) 0.251.00.25 0.25
Tstart (C) 60.60.60.50.75.
Tend (C) 200.275.275.200.220.
Heat rate (K/min) 4.4.4.5.4.
Initial hold (min) 5.   1.
Final hold (min) 25.   8.
I 1501.1492.1491.1496.1508.
ReferenceMeccia, Rojas, et al., 2000Mohagheghzadeh, Shams-Ardakani, et al., 2000Mohagheghzadeh, Shams-Ardakani, et al., 2000, 2Ayedoun, Adéoti, et al., 1999Bailac, Dellacasa, et al., 1999
Comment MSDC-RI MSDC-RI MSDC-RI MSDC-RI MSDC-RI
Column type CapillaryCapillaryCapillaryCapillaryCapillary
Active phase RTX-1DB-1BP-1OV-1DB-1
Column length (m) 30.25.25.25.50.
Carrier gas N2HeN2H2He
Substrate
Column diameter (mm) 0.250.250.500.250.25
Phase thickness (μm) 0.250.250.250.250.25
Tstart (C) 60.50.60.40.70.
Tend (C) 300.290.220.220.240.
Heat rate (K/min) 4.4.5.3.4.
Initial hold (min)    5.
Final hold (min)   10.5.
I 1495.1494.1497.1485.1474.
ReferenceKalemba, 1999Koulman, 1999Mallavarapu, Kulkarni, et al., 1999Oberhofer, Nikiforov, et al., 1999Palá-Paúl, Pérez-Alonso, et al., 1999
Comment MSDC-RI MSDC-RI MSDC-RI MSDC-RI MSDC-RI
Column type CapillaryCapillaryCapillaryCapillaryCapillary
Active phase CP Sil 5 CBCP Sil 5 CBDB-5CP Sil 5 CBDB-5
Column length (m) 25.25.30.25.30.
Carrier gas HeHeHeN2He
Substrate
Column diameter (mm) 0.250.320.25 0.25
Phase thickness (μm) 0.390.120.250.390.25
Tstart (C) 60.80.60.60.60.
Tend (C) 220.275.240.220.240.
Heat rate (K/min) 5.5.3.5.3.
Initial hold (min) 5.2.
Final hold (min) 20.10.
I 1499.1475.1494.1495.1496.
ReferenceRustaiyan, Masoudi, et al., 1999Rycroft, Cole, et al., 1999Tellez, Canel, et al., 1999Weyerstahl, Marschall, et al., 1999Zoghbi, Andrade, et al., 1999
Comment MSDC-RI MSDC-RI MSDC-RI MSDC-RI MSDC-RI
Column type CapillaryCapillaryCapillaryCapillaryCapillary
Active phase OV-101DB-5HP-1OV-101DB-1
Column length (m) 50.30.60.25.
Carrier gas HeHeHe
Substrate
Column diameter (mm) 0.220.250.250.32
Phase thickness (μm) 1.0.250.25
Tstart (C) 100.60.50.50.80.
Tend (C) 220.240.280.200.220.
Heat rate (K/min) 1.3.4.5.6.
Initial hold (min) 1. 5.
Final hold (min)
I 1479.1495.1490.1496.1487.
ReferenceCamciuc, Bessière, et al., 1998Maia, Zohhbi, et al., 1998Stashenko, Cervantes, et al., 1998Zollo, Biyiti, et al., 1998Salgueiro, Vila, et al., 1997
Comment MSDC-RI MSDC-RI MSDC-RI MSDC-RI MSDC-RI
Column type CapillaryCapillaryCapillaryCapillaryCapillary
Active phase DB-5SE-54DB-1DB-1BP-1
Column length (m) 30.30. 60.25.
Carrier gas HeHydrogen
Substrate
Column diameter (mm) 0.250.25 0.320.33
Phase thickness (μm)  0.25
Tstart (C) 60.60.50.50.45.
Tend (C) 240.250.230.230.180.
Heat rate (K/min) 4.2.4.4.3.
Initial hold (min)  5.  3.
Final hold (min)  2.10.10.
I 1490.1488.1489.1489.1486.
ReferenceZunino, Novillo-Newton, et al., 1997Kollmannsberger, Nitz, et al., 1992Binder, Turner, et al., 1990Binder, Turner, et al., 1990, 2Wyllie, Brophy, et al., 1990
Comment MSDC-RI MSDC-RI MSDC-RI MSDC-RI MSDC-RI
Column type CapillaryCapillaryCapillaryCapillary
Active phase DB-1SE-30DB-1SE-30
Column length (m) 60.30.10.30.
Carrier gas   H2
Substrate
Column diameter (mm) 0.32 0.25
Phase thickness (μm)   0.25
Tstart (C) 50.50.50.50.
Tend (C) 250.240.250.240.
Heat rate (K/min) 4.4.5.4.
Initial hold (min) 0.12. 2.
Final hold (min) 5.10. 10.
I 1488.1490.1492.1490.
ReferenceBinder and Flath, 1989Ramaswami, Briscese, et al., 1988Perry, Baxter, et al., 1986Ramaswami, Briscese, et al., 1986
Comment MSDC-RI MSDC-RI MSDC-RI MSDC-RI

Normal alkane RI, non-polar column, custom temperature program

Data compiled by: NIST Mass Spectrometry Data Center, William E. Wallace, director

Column type CapillaryCapillaryCapillaryCapillaryCapillary
Active phase DB-5DB-1Optima-5MSRTX-5RTX-5
Column length (m) 30.60.30.30.30.
Carrier gas HeliumHeliumHeliumNitrogenNitrogen
Substrate
Column diameter (mm) 0.250.250.320.250.25
Phase thickness (μm) 0.250.250.250.250.25
Program 50 0C m6 0C/min -> 140 0C 5 0C/min -> 160 0C (1 min) 10 0C/min -> 200 0C50 0C (5 min) 3 0C/min -> 120 0C 5 0C/min -> 250 0C (3 min) 15 0C/min -> 300 0C (20 min)40 0C (5 min) 5 0C/min -> 230 0C 30 0C/min -> 280 0C (5 min)60 0C 95 min) 110 0C 3 0C/min -> 200 0C 5 0C/min -> 220 0C 95 min)not specified
I 1502.1511.1494.1500.1500.
ReferenceCourtois, Paine, et al., 2009Delort and Jaquier, 2009HEuskin, Godin, et al., 2009Leela, Vipin, et al., 2009Leela, Vipin, et al., 2009
Comment MSDC-RI MSDC-RI MSDC-RI MSDC-RI MSDC-RI
Column type CapillaryCapillaryCapillaryCapillaryCapillary
Active phase HP-5DB-1DB-5HP-5CP Sil 8 CB
Column length (m) 25.30.25.30.50.
Carrier gas HeliumHydrogenNitrogenHeliumHelium
Substrate
Column diameter (mm) 0.320.250.220.250.32
Phase thickness (μm) 0.170.250.250.250.25
Program 60 0C (5 min) 4 0C/min -> 220 0C 11 0C/min -> 280 0C45 0C 3 0C/min -> 175 0C 15 0C/min -> 300 0C (10 min)not specifiednot specifiednot specified
I 1492.1487.1517.1494.1500.
ReferenceMaggi, Bilek, et al., 2009Mendes, Trindade, et al., 2009Chieng, Assim, et al., 2008Isidorov, Lech, et al., 2008Kupcinskiene, Stikliene, et al., 2008
Comment MSDC-RI MSDC-RI MSDC-RI MSDC-RI MSDC-RI
Column type CapillaryCapillaryCapillaryCapillaryCapillary
Active phase SLB-5 MSHP-5HP-5DB-5DB-5
Column length (m) 30.30.30.30.30.
Carrier gas HeliumHeliumHeliumHeliumHelium
Substrate
Column diameter (mm) 0.250.250.250.250.25
Phase thickness (μm) 0.250.250.25
Program not specified40 0C (3 min) 3 0C/min -> 160 0C (2 min) 8 0C/min -> 220 0C (3 min)not specified80 0C (2 min) 3 0C/min -> 180 0C 10 0C/min -> 300 0C (10 min)not specified
I 1494.1499.1491.1502.1500.
ReferenceLo Presti, Sciarrone, et al., 2008Qiao, Xie, et al., 2008Qiao, Xie, et al., 2008Santos, Costa, et al., 2008Santos, Costa, et al., 2008
Comment MSDC-RI MSDC-RI MSDC-RI MSDC-RI MSDC-RI
Column type CapillaryCapillaryCapillaryCapillaryCapillary
Active phase DB-5 MS5 % Phenyl methyl siloxaneDB-5HP-5MSHP-5MS
Column length (m) 30. 30.30.30.
Carrier gas   HeHeHe
Substrate
Column diameter (mm) 0.25 0.250.250.25
Phase thickness (μm) 0.25 0.250.250.25
Program 80 0C (1.5 min) 4 pC/min -> 180 0C 10 0C/min -> 300 0C (10 min)not specified35C => 4C/min => 180C => 10C/min => 250C40C => 3C/min => 100C => 5C/min => 230C(2min)40C(10min) => 3C/min => 200C => 2C/min => 220C
I 1500.1531.1501.1490.1497.
ReferenceSilva, Doria, et al., 2008Agabriel, Cornu, et al., 2007Albuquerque, Lemos, et al., 2007Chokeprasert P., Charles A.L., et al., 2007Cole, Haber, et al., 2007
Comment MSDC-RI MSDC-RI MSDC-RI MSDC-RI MSDC-RI
Column type CapillaryCapillaryCapillaryCapillaryCapillary
Active phase HP-5DB-1BP-5CP Sil 8 CBHP-1
Column length (m) 30.30.30.30.30.
Carrier gas  HeHeHeHe
Substrate
Column diameter (mm) 0.250.250.320.250.2
Phase thickness (μm) 0.250.250.250.250.33
Program 75C(4min) => 5C/min => 135C => 1C/min => 220C => 10C/min => 280C45C => 3C/min => 175C => 15C/min => 300C (10min)60C => 4C/min => 150C => 10C/min => 220C50C(3min) => 3C/min => 100C => 2.7C/min => 140C => 2.4C/min => 180C => 6C/min => 250C60C(5min) => 3C/min => 180C => 20C/min => 280C(10min)
I 1495.1487.1491.1495.1492.
ReferenceDuschatzky, Almeida, et al., 2007Ferreira, Meireles de Sousa, et al., 2007Hashemi, Abolghasemi, et al., 2007Meekijjaroenroj, Bessière, et al., 2007Merle, Verdeguer, et al., 2007
Comment MSDC-RI MSDC-RI MSDC-RI MSDC-RI MSDC-RI
Column type CapillaryCapillaryCapillaryCapillaryCapillary
Active phase CP Sil 8 CBHP-5 MSHP-5 MSHP-5MSCP-Sil
Column length (m) 50.30.30.30.30.
Carrier gas HeHeliumHeliumHeHelium
Substrate
Column diameter (mm) 0.320.250.250.250.25
Phase thickness (μm) 0.250.250.250.250.25
Program 60 0C (2 min) 5 0C/min -> 160 0C 5 0C/min -> 250 0C (10 min)40 0C (10 min) 3 0C/min -> 200 0C 2 0C/min -> 220 0C40 0C (10 min) 3 0C/min -> 200 0C 2 0C/min -> 220 0C40C(10min) => 3C/min => 200C => 2C/min => 220C50 0C (3 min) 3 0C/min -> 100 0C 2.7 0C/min -> 140 0C 2.4 0C/min -> 180 0C 6 0C/min -> 250 0C
I 1500.1499.1499.1495.1480.
ReferenceMockute, Bernotiene, et al., 2007Moriarity, Bansal, et al., 2007Moriarity, Bansal, et al., 2007Moronkola, Ogunwande, et al., 2007Proffit, 2007
Comment MSDC-RI MSDC-RI MSDC-RI MSDC-RI MSDC-RI
Column type CapillaryCapillaryCapillaryCapillaryCapillary
Active phase CP-SilCP Sil 8 CBHP-5DB-1DB-5
Column length (m) 30.50.30.30.30.
Carrier gas HeliumHeliumHeliumHeHydrogen
Substrate
Column diameter (mm) 0.250.320.250.250.25
Phase thickness (μm) 0.250.250.250.250.25
Program 50 0C (3 min) 3 0C/min -> 100 0C 2.7 0C/min -> 140 0C 2.4 0C/min -> 180 0C 6 0C/min -> 250 0C60 0C (2 min) 5 0C/min -> 160 0C (1 min) 10 0C/min -> 280 0C (3 min)not specified45C => 3C/min => 175C => 15C/min => 300C(10min)35 0C 4 0C/min -> 180 0C 17 0C/min -> 280 0C (10 min)
I 1499.1500.1500.1487.1500.
ReferenceProffit, 2007Radusiene, Judzentiene, et al., 2007Ristic, Krivokuca-Dokic, et al., 2007Rodrigues, Antunes, et al., 2007Santos, Santiago, et al., 2007
Comment MSDC-RI MSDC-RI MSDC-RI MSDC-RI MSDC-RI
Column type CapillaryCapillaryCapillaryCapillaryCapillary
Active phase HP-5 MSHP-5 MSHP-5MSPolydimethyl siloxaneDB-5
Column length (m) 30. 30. 30.
Carrier gas Helium He He
Substrate
Column diameter (mm) 0.25 0.25 0.25
Phase thickness (μm)     0.25
Program 40 0C (10 min) 3 oC/min -> 200 0C 2 0C/min -> 220 0Cnot specified40C(10min) => 3C/min => 200C => 2C/min => 220Cnot specified35C => 4C/min => 180C => 10C/min => 250C
I 1494.1497.1496.1495.1501.
ReferenceSetzer, Stokes, et al., 2007Stokes, Cole, et al., 2007Takaku, Haber, et al., 2007Werka, Boehme, et al., 2007Albuquerque, Canuto, et al., 2006
Comment MSDC-RI MSDC-RI MSDC-RI MSDC-RI MSDC-RI
Column type CapillaryCapillaryCapillaryCapillaryCapillary
Active phase HP-5MSCP Sil 8 CBHP-5DB-1CP Sil 8 CB
Column length (m) 30.50.30.30.50.
Carrier gas HeHeHeliumHeHe
Substrate
Column diameter (mm) 0.250.320.320.250.32
Phase thickness (μm) 0.250.250.25 0.25
Program 50C(3min) => 3C/min => 150C(10min) => 10C/min => 250C60C(2min) => 5C/min => 160C(1min) => 10C/min => 250C (5min)not specified35C => 4C/min => 180C => 10C/min => 250C60 0C (2 min) 5 0C/min -> 160 0C 10 0C/min -> 250 0C (5 min)
I 1534.1500.1496.1488.1494.
ReferenceGüllüce, Özer, et al., 2006Judzentiene and Buzelyte, 2006Kucuk, Gulec, et al., 2006de Lima, Maia, et al., 2006Mockute, Bernotiene, et al., 2006
Comment MSDC-RI MSDC-RI MSDC-RI MSDC-RI MSDC-RI
Column type CapillaryCapillaryCapillaryCapillaryCapillary
Active phase SPB-5DB-5HP-5 MSDB-1SE-52
Column length (m) 30.30.30. 30.
Carrier gas HeliumHeHeliumHeliumHe
Substrate
Column diameter (mm) 0.250.250.25 0.32
Phase thickness (μm) 0.100.250.25 0.15
Program 40 0C (1 min) 10 0C/min -> 120 0C 0.5 0C/min -> 150 0C 20 0C/min -> 280 0C (5 min)35C => 4C/min => 180C => 10C/min => 250C40 0C (10 min) 3 0C/min -> 200 0C 2 0C/min -> 220 0Cnot specified45C => 1C/min => 100C => 5C/min => 250C (10min)
I 1494.1503.1496.1494.1500.
ReferenceNavickiene, Morandim, et al., 2006Santos, Nunes, et al., 2006Schmidt, Noletto, et al., 2006Soumaghi, Amin, et al., 2006Tognolini, Barocelli, et al., 2006
Comment MSDC-RI MSDC-RI MSDC-RI MSDC-RI MSDC-RI
Column type CapillaryCapillaryCapillaryCapillaryCapillary
Active phase DB-5MSCP Sil 8 CBDB-5DB-1HP-5MS
Column length (m) 30.50.30.30.30.
Carrier gas  HeHeHeHe
Substrate
Column diameter (mm) 0.250.320.250.250.25
Phase thickness (μm) 0.250.250.250.250.25
Program 70C(2min) => 10C/min => 150C(15min) => 5C/min => 240C50C(5min) => 2C/min => 90C => 15C/min => 240C(4min)35C => 4C/min => 180C => 10C/min => 250C45C => 3C/min => 175C => 15C/min => 300C (10min)not specified
I 1477.1499.1499.1487.1494.
ReferenceBagci and Baser, 2005Butkienë, Nivinskienë, et al., 2005Cysne, Canuto, et al., 2005Figueiredo, Sim-Sim, et al., 2005Grombone-Guaratini, Silva-Brandão, et al., 2005
Comment MSDC-RI MSDC-RI MSDC-RI MSDC-RI MSDC-RI
Column type CapillaryCapillaryCapillaryCapillaryCapillary
Active phase BPX-5HP-5MSDB-1CP Sil 8 CBDB-5
Column length (m) 30.30. 50.30.
Carrier gas    HeHe
Substrate
Column diameter (mm) 0.250.25 0.320.25
Phase thickness (μm) 0.250.25 0.250.1
Program 60C(0.2min) => 3K/min => 186C => 10C/min => 240C (5min)40C(5min) => 3C/min => 90C => 10C/min => 280Cnot specified60C(2min) => 5C/min => 160C(1min) => 10C/min => 250C (3min)35C => 4C/min => 180C => 10C/min => 250C
I 1494.1503.1494.1500.1500.
ReferenceJudzentiene and Mockute, 2005Novak, Draxler, et al., 2005Omidbaigi and Bastan, 2005Radudienë, Judpintienë, et al., 2005Albuquerque, Silveira, et al., 2004
Comment MSDC-RI MSDC-RI MSDC-RI MSDC-RI MSDC-RI
Column type CapillaryCapillaryCapillaryCapillaryCapillary
Active phase DB-5CP Sil 8 CBDB-1Methyl SiliconeCP Sil 8 CB
Column length (m) 30.50.30. 50.
Carrier gas HeHeHe He
Substrate
Column diameter (mm) 0.250.320.25 0.32
Phase thickness (μm) 0.10.25
Program 35C => 4C/min => 180C => 10C/min => 250C50C(5min) => 2C/min => 90C => 15C/min => 240C(4min)35C => 4C/min => 180C => 10C/min => 250Cnot specified60C(2min) => 5C/min => 160C (1min) => 10C/min => 250C (2min)
I 1476.1499.1488.1494.1494.
ReferenceAlbuquerque, Souza, et al., 2004Butkienë, Nivinskienë, et al., 2004Cavalcanti, de Morais, et al., 2004Couladis, Özcan, et al., 2004Judpentienë and Mockutë, 2004
Comment MSDC-RI MSDC-RI MSDC-RI MSDC-RI MSDC-RI
Column type CapillaryCapillaryCapillaryCapillaryCapillary
Active phase BPX-5DB-5DB-1CP Sil 8 CBCP Sil 8 CB
Column length (m) 30.30.30.50.50.
Carrier gas H2HeHeHeHe
Substrate
Column diameter (mm) 0.250.250.250.320.32
Phase thickness (μm) 0.250.250.25 0.25
Program 50 0C (1 min) 3 0C/min -> 150 0C 5 0C/min -> 250 0C (5 min)60C(4min) => 6C/min => 240 => 10C/min => 280C45C => 3C/min => 175C => 15C/min => 300C (10min)50 0C (2 min) 3 0C/min -> 180 0C (1 min) 20 0C/min -> 250 0C (2 min)50C(2min) => 3C/min => 180C(1min) => 20C/min => 250C (2min)
I 1500.1494.1487.1494.1494.
ReferenceKoba, Sanda, et al., 2004Letchamo, Ward, et al., 2004Miguel, Simões, et al., 2004Mockutë, Bernotienë, et al., 2004Mockutë, Judbentienë, et al., 2004
Comment MSDC-RI MSDC-RI MSDC-RI MSDC-RI MSDC-RI
Column type CapillaryCapillaryCapillaryCapillaryCapillary
Active phase HP-5MSDB-1HP-5MSHP-5DB-5
Column length (m) 30.30.30.30.
Carrier gas HeHelium He
Substrate
Column diameter (mm) 0.250.250.250.25
Phase thickness (μm) 0.250.250.250.25
Program 50C(3min) => 3C/min => 150C(10min) => 10C/min => 250C35 0C 4 0C/min -> 180 0C 10 0C/min -> 250 0C60C(1min) => 1.5C/min => 185C(1min) => 9C/min => 275C(2min)50C (3min) => 3C/min => 150C (10min) => 10C/min => 250Cnot specified
I 1500.1486.1496.1500.1494.
ReferenceSahin, Gulluce, et al., 2004Silva, Matos, et al., 2004Singh, Marimuthu, et al., 2004Tepe, Donmez, et al., 2004Vilaseca, Guy, et al., 2004
Comment MSDC-RI MSDC-RI MSDC-RI MSDC-RI MSDC-RI
Column type CapillaryCapillaryCapillaryCapillaryCapillary
Active phase SE-30HP-5CP-Sil 8CB-MSCP Sil 8 CBDB-1
Column length (m)  30.50.50.30.
Carrier gas  HeHeHeHe
Substrate
Column diameter (mm)  0.250.320.320.25
Phase thickness (μm)  0.25 0.250.1
Program not specified50C(3min) => 3C/min => 150C(10min) => 10 C/min => 250C50C(2min) => 3C/min => 180C(1min) => 20C/min => 250C(2min)70C(5min) => 3C/min => 100C (1min) => 25C/min => 250C (10min)35C => 4C/min => 180C => 10C/min => 250C
I 1490.1500.1494.1494.1491.
ReferenceVinogradov, 2004Güllüce, Sökmen, et al., 2003Mockute, Bernotiene, et al., 2003Mockute and Judzentiene, 2003Silva, Matos, et al., 2003
Comment MSDC-RI MSDC-RI MSDC-RI MSDC-RI MSDC-RI
Column type CapillaryCapillaryCapillaryCapillaryCapillary
Active phase HP-5SE-54CP Sil 8 CBCP Sil 8 CBDB-5
Column length (m) 30. 50.50.30.
Carrier gas He HeHeHe
Substrate
Column diameter (mm) 0.25 0.320.320.25
Phase thickness (μm) 0.25   0.25
Program 60C(5min) => 1C/min => 140C => 10C/min => 270C(5min)not specified60C(2min) => 5C/min => 160C(1min) => 10C/min => 250C (2min)60C(2min) => 5C/min => 160C(1min) => 10C/min => 250C(2min)35C => 4C/min => 180C => 20C/min => 280C
I 1495.1467.1494.1494.1483.
ReferenceSingh, Singh, et al., 2003Kilic, 2002Mockute and Judzentiene, 2002Mockute and Judzentiene, 2002, 2Viana, Andrade-Neto, et al., 2002
Comment MSDC-RI MSDC-RI MSDC-RI MSDC-RI MSDC-RI
Column type CapillaryCapillaryCapillaryCapillaryCapillary
Active phase HP-5DB-5DB-1HP-5DB-5
Column length (m) 30. 30.30.30.
Carrier gas    HeHe
Substrate
Column diameter (mm) 0.25 0.250.250.25
Phase thickness (μm) 0.25 0.250.250.25
Program not specifiednot specified45 0C 3 K/min -> 175 0C 15 K/min -> 300 0C (10 min)50 0C 3 K/min -> 200 0C 8 K/min -> 280 0C40C => 2C/min => 60C => 4C/min => 260C
I 1492.1487.1487.1487.1496.
ReferenceAparicio, Romero, et al., 2001Ferreira, Costantin, et al., 2001Figueiredo, Miguel, et al., 2001Usubillaga, Aparicio, et al., 2001Andrade, Maia, et al., 2000
Comment MSDC-RI MSDC-RI MSDC-RI MSDC-RI MSDC-RI
Column type CapillaryCapillaryCapillaryCapillaryCapillary
Active phase HP-1HP-5MSDB-1DB-5DB-1
Column length (m) 12.30.30.30.30.
Carrier gas HeHeHeN2H2
Substrate
Column diameter (mm) 0.200.250.250.250.25
Phase thickness (μm) 0.330.250.250.250.25
Program 40 0C 6.7 0C/min -> 87 0C (9 min) 10 0C/min -> 187 0Cnot specified45C => 3C/min => 175C => 15C/min => 240C (10min)45C(5min) => 2C/min => 200C => 5C/min => 250C45C => 3C/min => 175C => 15C => 240C(10min)
I 1484.1504.1487.1502.1487.
ReferenceBetts, 2000Bouwmeester, Wallaart, et al., 1999Baratta, Dorman, et al., 1998Sanda, Koba, et al., 1998da Silva, Figueiredo, et al., 1998
Comment MSDC-RI MSDC-RI MSDC-RI MSDC-RI MSDC-RI
Column type CapillaryCapillaryCapillaryCapillaryCapillary
Active phase CP Sil 5 CBCP Sil 5 CBCP Sil 5 CBMethyl SiliconeOV-101
Column length (m) 25.25.30.
Carrier gas N2N2N2
Substrate
Column diameter (mm)   0.25
Phase thickness (μm)
Program not specifiednot specifiednot specifiednot specifiednot specified
I 1494.1493.1492.1490.1500.
ReferenceWeyerstahl, Marschall, et al., 1998Weyerstahl, Marschall, et al., 1997Weyerstahl, Marschall, et al., 1997, 2Zenkevich, 1996Menut, Lamaty, et al., 1994
Comment MSDC-RI MSDC-RI MSDC-RI MSDC-RI MSDC-RI
Column type Capillary
Active phase DB-1
Column length (m) 60.
Carrier gas
Substrate
Column diameter (mm) 0.32
Phase thickness (μm)
Program not specified
I 1490.
ReferenceBinder and Flath, 1989
Comment MSDC-RI

Van Den Dool and Kratz RI, polar column, temperature ramp

Data compiled by: NIST Mass Spectrometry Data Center, William E. Wallace, director

Column type CapillaryCapillaryCapillaryCapillaryCapillary
Active phase BP-20BP-20BP-20RTX-WaxRTX-Wax
Column length (m) 50.50.50.60.60.
Carrier gas HeHeHeHeHe
Substrate
Column diameter (mm) 0.220.220.220.220.22
Phase thickness (μm) 0.250.250.250.250.25
Tstart (C) 60.60.60.60.60.
Tend (C) 220.220.220.230.230.
Heat rate (K/min) 2.2.2.2.2.
Initial hold (min)
Final hold (min) 20.20.20.30.35.
I 1730.1708.1742.1699.1724.
ReferenceBoti, Koukoua, et al., 2007Castilho, Liu, et al., 2007Lesueur, de Rocca Serra, et al., 2007Muselli, Rossi, et al., 2007Paolini J., Costa J., et al., 2007
Comment MSDC-RI MSDC-RI MSDC-RI MSDC-RI MSDC-RI
Column type CapillaryCapillaryCapillaryCapillaryCapillary
Active phase RTX-WaxDB-WaxHP-WaxDB-WaxPEG-20M
Column length (m) 60.30.30.60.25.
Carrier gas HeHeN2HeHe
Substrate
Column diameter (mm) 0.220.250.250.320.25
Phase thickness (μm) 0.250.250.250.250.3
Tstart (C) 60.40.60.35.50.
Tend (C) 230.250.220.220.220.
Heat rate (K/min) 2.3.5.3.3.
Initial hold (min)  5.10. 1.
Final hold (min) 35.10.  5.
I 1724.1736.1737.1734.1728.
ReferencePaolini, Muselli, et al., 2007Aromdee and Sriubolmas, 2006Flamini, Tebano, et al., 2006Pala-Paul, Copeland, et al., 2006Rubiolo P., Matteodo M., et al., 2006
Comment MSDC-RI MSDC-RI MSDC-RI MSDC-RI MSDC-RI
Column type CapillaryCapillaryCapillaryCapillaryCapillary
Active phase Supelcowax-10DB-WaxPEGDB-WaxDB-Wax
Column length (m) 30.60.30.30.30.
Carrier gas HeN2N2HeHe
Substrate
Column diameter (mm) 0.20.250.320.250.25
Phase thickness (μm) 0.20.250.250.250.25
Tstart (C) 70.70.50.40.40.
Tend (C) 220.230.220.250.250.
Heat rate (K/min) 3.2.2.3.3.
Initial hold (min)  2.3.
Final hold (min) 15.20.15.20.20.
I 1726.1736.1723.1718.1719.
ReferenceSalgueiro L.R., Pinto E., et al., 2006Choi, 2005Dob, Berramdane, et al., 2005Fanciullino, Gancel, et al., 2005Gancel, Ollitrault, et al., 2005
Comment MSDC-RI MSDC-RI MSDC-RI MSDC-RI MSDC-RI
Column type CapillaryCapillaryCapillaryCapillaryCapillary
Active phase InnowaxRTX-WaxBP-20MegawaxDB-Wax
Column length (m) 50.60.50.30.30.
Carrier gas HeHeHeHeN2
Substrate
Column diameter (mm) 0.250.220.220.250.25
Phase thickness (μm) 0.250.250.250.250.25
Tstart (C) 50.60.60.40.60.
Tend (C) 220.230.230.220.220.
Heat rate (K/min) 2.2.2.2.5.
Initial hold (min) 3.  6.10.
Final hold (min) 20.35.35.10.
I 1720.1724.1727.1688.1767.
ReferenceLee, Lee, et al., 2005Paolini, Costa, et al., 2005Vellutini, Baldovini, et al., 2005Verzera, Trozzi, et al., 2005Bertoli, Menichini, et al., 2004
Comment MSDC-RI MSDC-RI MSDC-RI MSDC-RI MSDC-RI
Column type CapillaryCapillaryCapillaryCapillaryCapillary
Active phase DB-WaxSupelcowax-10RTX-WaxHP-WaxDB-Wax
Column length (m) 60.30.30.30.30.
Carrier gas HeHeHeN2He
Substrate
Column diameter (mm) 0.320.20.250.250.25
Phase thickness (μm) 0.250.20.250.250.25
Tstart (C) 32.70.45.60.40.
Tend (C) 220.220.240.220.200.
Heat rate (K/min) 3.3.3.5.4.
Initial hold (min)   6.10.5.
Final hold (min)  15.10. 20.
I 1733.1726.1707.1721.1711.
ReferenceBrophy, Goldsack, et al., 2004Cavaleiro, Salgueiro, et al., 2004Dugo, Mondello, et al., 2004Flamini, Luigi Cioni, et al., 2004Yu, Kim, et al., 2004
Comment MSDC-RI MSDC-RI MSDC-RI MSDC-RI MSDC-RI
Column type CapillaryCapillaryCapillaryCapillaryCapillary
Active phase HP-WaxCarbowax 20MDB-WaxDB-WaxDB-Wax
Column length (m) 30.25.30.60.60.
Carrier gas N2HeHeN2H2
Substrate
Column diameter (mm) 0.250.250.250.250.32
Phase thickness (μm) 0.250.30.250.250.25
Tstart (C) 60.50.40.70.40.
Tend (C) 220.200.250.230.245.
Heat rate (K/min) 5.3.3.2.1.5
Initial hold (min) 10.1. 2.
Final hold (min)  20.20.20.20.
I 1721.1728.1707.1738.1719.
ReferenceBader, Caponi, et al., 2003Bicchi, Rubiolo, et al., 2003Brat, Rega, et al., 2003Choi, 2003Gancel, Ollitrault, et al., 2003
Comment MSDC-RI MSDC-RI MSDC-RI MSDC-RI MSDC-RI
Column type CapillaryCapillaryCapillaryCapillaryCapillary
Active phase RTX-WaxHP-InnowaxMegawaxBP-20DB-Wax
Column length (m) 30.30.30.50.60.
Carrier gas HeHeHeHeHe
Substrate
Column diameter (mm) 0.250.250.250.220.50
Phase thickness (μm) 0.250.50.250.251.0
Tstart (C) 45.60.40.60.60.
Tend (C) 250.260.220.220.225.
Heat rate (K/min) 3.3.2.2.3.
Initial hold (min) 6. 6.
Final hold (min)   10.20.
I 1704.1730.1688.1727.1732.
ReferenceShellie, Marriott, et al., 2003Skaltsa, Demetzos, et al., 2003Verzera, Trozzi, et al., 2003Lota, de Rocca Serra, et al., 2002Brophy, Goldsack, et al., 2000
Comment MSDC-RI MSDC-RI MSDC-RI MSDC-RI MSDC-RI
Column type CapillaryCapillaryCapillaryCapillaryCapillary
Active phase DB-WaxDB-WaxCP-Wax 52CBDB-WaxSupelcowax-10
Column length (m) 60.60.25.30.30.
Carrier gas HeHe HeHe
Substrate
Column diameter (mm) 0.530.530.250.250.32
Phase thickness (μm) 1.01.00.150.250.25
Tstart (C) 50.50.40.40.75.
Tend (C) 220.220.220.200.200.
Heat rate (K/min) 3.3.3.2.2.5
Initial hold (min)   5.5.
Final hold (min)    20.
I 1732.1735.1744.1735.1706.
ReferenceBrophy, Goldsack, et al., 2000, 2Brophy, Goldsack, et al., 2000, 3Chagonda, Makanda, et al., 2000Kim, Thuy, et al., 2000Lazari, Skaltsa, et al., 2000
Comment MSDC-RI MSDC-RI MSDC-RI MSDC-RI MSDC-RI
Column type CapillaryCapillaryCapillaryCapillaryCapillary
Active phase MegawaxDB-WaxDB-WaxInnowaxCarbowax 20M
Column length (m) 30.60.60.60.25.
Carrier gas HeHeHeHeH2
Substrate
Column diameter (mm) 0.250.530.530.250.25
Phase thickness (μm) 0.25  0.250.3
Tstart (C) 40.50.50.50.50.
Tend (C) 220.220.220.180.200.
Heat rate (K/min) 2.3.3.2.53.
Initial hold (min) 6.  5.1.
Final hold (min) 10.   20.
I 1688.1732.1732.1744.1726.
ReferenceVerzera, Trozzi, et al., 2000Brophy, Goldsack, et al., 1999Brophy, Goldsack, et al., 1999, 2Stashenko, Cervantes, et al., 1999Bicchi, Rubiolo, et al., 1998
Comment MSDC-RI MSDC-RI MSDC-RI MSDC-RI MSDC-RI
Column type CapillaryCapillaryCapillaryCapillaryCapillary
Active phase DB-WaxSP-1000DB-WaxDB-WaxCarbowax 20M
Column length (m) 60.85.60.60.25.
Carrier gas HeHeHeHe
Substrate
Column diameter (mm) 0.320.50.320.320.25
Phase thickness (μm)     0.3
Tstart (C) 35.60.65.35.50.
Tend (C) 220.225.225.220.200.
Heat rate (K/min) 3.3.3.3.3.
Initial hold (min)     1.
Final hold (min)     20.
I 1739.1732.1732.1732.1729.
ReferenceBrophy, Forster, et al., 1998Brophy, Forster, et al., 1998, 2Brophy, Goldsack, et al., 1998Brophy, Goldsack, et al., 1998, 2Bicchi, Fresia, et al., 1997
Comment MSDC-RI MSDC-RI MSDC-RI MSDC-RI MSDC-RI
Column type CapillaryCapillaryCapillaryCapillaryCapillary
Active phase DB-WaxSP-1000BP-20Supelcowax-10Carbowax 20M
Column length (m) 60.85.50.60.50.
Carrier gas HeHeHeHeHe
Substrate
Column diameter (mm) 0.320.50.220.250.2
Phase thickness (μm)   0.250.250.2
Tstart (C) 65.65.60.60.30.
Tend (C) 225.225.230.230.170.
Heat rate (K/min) 3.3.2.5.4.
Initial hold (min)    5.2.
Final hold (min)   35.20.20.
I 1732.1732.1724.1755.1741.
ReferenceBrophy, Goldsack, et al., 1997Brophy, Goldsack, et al., 1997, 2Mariotti, Costa, et al., 1997Granicher, Christen, et al., 1995Píry, Príbela, et al., 1995
Comment MSDC-RI MSDC-RI MSDC-RI MSDC-RI MSDC-RI
Column type Capillary
Active phase DB-Wax
Column length (m) 30.
Carrier gas He
Substrate
Column diameter (mm) 0.32
Phase thickness (μm) 0.5
Tstart (C) 40.
Tend (C) 220.
Heat rate (K/min) 3.
Initial hold (min)
Final hold (min)
I 1728.
ReferenceLe Quere and Latrasse, 1990
Comment MSDC-RI

References

Angioni, Barra, et al., 2006
Angioni, A.; Barra, A.; Coroneo, V.; Dessi, S.; Cabras, P., Chemical composition, seasonal variability, and antifungal activity of Lavandula stoechas L. ssp. stoechas essential oils from stem/leaves and flowers, J. Agric. Food Chem., 2006, 54, 12, 4364-4370, https://doi.org/10.1021/jf0603329 . [all data]

Hazzit, Baaliouamer, et al., 2006
Hazzit, M.; Baaliouamer, A.; Faleiro, M.L.; Miguel, M.G., Composition of the Essential Oils of Thymus and Origanum Species from Algeria and Their Antioxidant and Antimicrobial Activities, J. Agric. Food Chem., 2006, 54, 17, 6314-6321, https://doi.org/10.1021/jf0606104 . [all data]

Jalali-Heravi, Zekavat, et al., 2006
Jalali-Heravi, M.; Zekavat, B.; Sereshti, H., Characterization of essential oil components of Iranian geranium oil using gas chromatography-mass spectrometry combined with chemometric resolution techniques, J. Chromatogr. A, 2006, 1114, 1, 154-163, https://doi.org/10.1016/j.chroma.2006.02.034 . [all data]

Marongiu, Porcedda, et al., 2006
Marongiu, B.; Porcedda, S.; Piras, A.; Sanna, G.; Murreddu, M.; Loddo, R., Extraction of Juniperus communis L. ssp. nana Willd. essential oil by supercritical carbon dioxide, Flavour Fragr. J., 2006, 21, 1, 148-154, https://doi.org/10.1002/ffj.1549 . [all data]

Meccia G., Rosquete C., et al., 2006
Meccia G.; Rosquete C.; Rojas L.B.; San Felician A., New labdane derivative from the essential oil of Acalypha plicata Mull.Arg., Flavour Fragr. J., 2006, 21, 3, 559-561, https://doi.org/10.1002/ffj.1679 . [all data]

Oliveira, Leitao, et al., 2006
Oliveira, D.R.; Leitao, G.G.; Santos, S.S.; Bizzo, H.R.; Lopes, D.; Alviano, C.S.; Alviano, D.S.; Leitao, S.G., Ethnopharmacological study of two Lippia species from Oriximina, Brazil, J. Ethnopharmacol., 2006, 108, 1, 103-108, https://doi.org/10.1016/j.jep.2006.04.018 . [all data]

Sylvestre, Pichette, et al., 2006
Sylvestre, M.; Pichette, A.; Longtin, A.; Nagau, F.; Legault, J., Essential oil analysis and anticancer activity of leaf essential oil of Croton flavens L. from Guadeloupe, J. Ethnopharmacol., 2006, 103, 1, 99-102, https://doi.org/10.1016/j.jep.2005.07.011 . [all data]

Tepe, Askin Akpulat, et al., 2006
Tepe, B.; Askin Akpulat, H.; Sokmen, M.; Daferera, D.; Yumrutas, O.; Aydin, E.; Polissiou, M.; Sokmen, A., Screening of the antioxidative and antimicrobial properties of the essential oils of Pimpinella anisetum and Pimpinella flabellifolia from Turkey, Food Chem., 2006, 97, 4, 719-724, https://doi.org/10.1016/j.foodchem.2005.05.045 . [all data]

Asuming, Beauchamp, et al., 2005
Asuming, W.A.; Beauchamp, P.S.; Descalzo, J.T.; Dev, B.C.; Dev, V.; Frost, S.; Ma, C.W., Essential oil composition of four Lomatium Raf. species and their chemotaxonomy, Biochem. Syst. Ecol., 2005, 33, 1, 17-26, https://doi.org/10.1016/j.bse.2004.06.005 . [all data]

Baranauskiene, Venskutonis, et al., 2005
Baranauskiene, R.; Venskutonis, R.P.; Demyttenaere, J.C.R., Sensory and instrumental evaluation of sweet marjoram (Origanum majorana L.) aroma, Flavour Fragr. J., 2005, 20, 5, 492-500, https://doi.org/10.1002/ffj.1478 . [all data]

Maia, Andrade, et al., 2005
Maia, J.G.S.; Andrade, E.H.A.; da Silva, A.C.M.; Oliveira, J.; Carreira, L.M.M.; Araújo, J.S., Leaf volatile oils from four Brazilian Xylopia species, Flavour Fragr. J., 2005, 20, 5, 474-477, https://doi.org/10.1002/ffj.1499 . [all data]

Santos, Lopes, et al., 2004
Santos, A.P.; Lopes, M.C.; Limberger, R.P.; Apel, M.A.; Henriques, A.T.; Moreno, P.R.H., Analysis of the volatile oil from Pilocarpus pennatifolius Lemmaire (Rutaceae) leaves by GC-MS, Flavour Fragr. J., 2004, 19, 4, 325-326, https://doi.org/10.1002/ffj.1306 . [all data]

Siani, Garrido, et al., 2004
Siani, A.C.; Garrido, I.S.; Monteiro, S.S.; Carvalho, E.S.; Ramos, M.F.S., Protium icicariba as a source of volatile essences, Biochem. Syst. Ecol., 2004, 32, 5, 477-489, https://doi.org/10.1016/j.bse.2003.11.003 . [all data]

Velasco-Negueruela, Sanz, et al., 2004
Velasco-Negueruela, A.; Sanz, J.; Pérez-Alonso, M.J.; Palá-Paúl, J., The volatile components of the aerial parts of Melittis melissophyllum L. subsp. melissophyllum gathered in Spain, Botanica Complutensis, 2004, 28, 133-136. [all data]

Ogunwande, Olawore, et al., 2003
Ogunwande, I.A.; Olawore, N.O.; Kasali, A.A.; König, W.A., Chemical composition of the leaf volatile oils of Callitris intratropica R.T. Baker H.G. Smith from Nigeria, Flavour Fragr. J., 2003, 18, 5, 387-389, https://doi.org/10.1002/ffj.1214 . [all data]

El-Ghorab, Fadel, et al., 2002
El-Ghorab, A.H.; Fadel, H.M.; El-Massry, K.F., The Egyptian Eucalyptus camaldulensis var. brevirostris: chemical compositions of the fruit volatile oil and antioxidant activity, Flavour Fragr. J., 2002, 17, 4, 306-312, https://doi.org/10.1002/ffj.1085 . [all data]

Juliani and Simon, 2002
Juliani, H.R.; Simon, J.E., Antioxidant acitivity of basil in Trends in new crops and new uses, Janick,J.; Whipkey,A., ed(s)., ASHA Press, Alexandria, Va, 2002, 575-579. [all data]

Shawl, Srivastava, et al., 2002
Shawl, A.S.; Srivastava, S.K.; Syamasundar, K.V.; Tripathi, S.; Raina, V.K., Essential oil composition of Achillea millefolium L. growing wild in Kashmir, India, Flavour Fragr. J., 2002, 17, 3, 165-168, https://doi.org/10.1002/ffj.1074 . [all data]

Adams, 2000
Adams, R.P., Systematics of Juniperus section Juniperus based on leaf essential oils and random amplified polymorphic DNAs (RAPDs), Biochem. Syst. Ecol., 2000, 28, 6, 515-528, https://doi.org/10.1016/S0305-1978(99)00089-7 . [all data]

Kardali, Velasco-Negueruela, et al., 2000
Kardali, M.; Velasco-Negueruela, A.; Pérez-Alonso, M., Essential Oil Constituents of Sideritis ibanyezii Pau, Botanica Complutensis, 2000, 24, 101-106. [all data]

Weissbecker B., Van Loon J.J.A., et al., 2000
Weissbecker B.; Van Loon J.J.A.; Posthumus M.A.; Bouwmeester H.J.; Dicke M., Identification of volatile potato sesquiterpenoids and their olfactory detection by the two-spotted stinkbug Perillus bioculatus, J. Chem. Ecol., 2000, 26, 6, 1433-1445, https://doi.org/10.1023/A:1005535708866 . [all data]

Adams, 1999
Adams, R.P., Systematics of multi-seeded eastern hemisphere Juniperus based on leaf essential oils and RAPD DNA fingerprinting, Biochem. Syst. Ecol., 1999, 27, 7, 709-725, https://doi.org/10.1016/S0305-1978(99)00016-2 . [all data]

Kaul, Gujral, et al., 1999
Kaul, V.K.; Gujral, R.K.; Singh, B., Volatile constituents of the essential oil of flowers of Rosa brunonii Lindl, Flavour Fragr. J., 1999, 14, 1, 9-11, https://doi.org/10.1002/(SICI)1099-1026(199901/02)14:1<9::AID-FFJ761>3.0.CO;2-C . [all data]

da Silva, Andrade, et al., 1999
da Silva, M.H.L.; Andrade, E.H.A.; Zoghbi, M.G.B.; Luz, A.I.R.; da Silva, J.D.; Maia, J.G.S., The essential oils of Lantana camara L. occurring in North Brazil, Flavour Fragr. J., 1999, 14, 4, 208-210, https://doi.org/10.1002/(SICI)1099-1026(199907/08)14:4<208::AID-FFJ811>3.0.CO;2-F . [all data]

da Silva, Zoghbi, et al., 1999
da Silva, M.H.L.; Zoghbi, M.G.B.; Andrade, E.H.A.; Maia, J.G.S., The essential oils of Peperomia pellucida Kunth and P. circinnata link var. circinnata, Flavour Fragr. J., 1999, 14, 5, 312-314, https://doi.org/10.1002/(SICI)1099-1026(199909/10)14:5<312::AID-FFJ835>3.0.CO;2-B . [all data]

Vera and Chane-Ming, 1999
Vera, R.R.; Chane-Ming, J., Chemical composition of the essential oil of marjoram (Origanum majorana L.) from Reunion Island, Food Chem., 1999, 66, 2, 143-145, https://doi.org/10.1016/S0308-8146(98)00018-1 . [all data]

Szafranek, Malinski, et al., 1998
Szafranek, B.; Malinski, E.; Szafranek, J., The sesquiterpene composition of leaf cuticular neutral lipids of ten varieties of polish Solanum tuberosum, J. Sci. Food Agric., 1998, 76, 4, 588-592, https://doi.org/10.1002/(SICI)1097-0010(199804)76:4<588::AID-JSFA994>3.0.CO;2-M . [all data]

Tellez, Estell, et al., 1997
Tellez, M.R.; Estell, R.E.; Fredrickson, E.L.; Havstad, K.M., Essential oil of Dyssodia acerosa DC., J. Agric. Food Chem., 1997, 45, 8, 3276-3278, https://doi.org/10.1021/jf9701502 . [all data]

Loayza, Abujder, et al., 1995
Loayza, I.; Abujder, D.; Aranda, R.; Jakupovic, J.; Collin, G.; Deslauriers, H.; Jean, F.-I., Essential oils of Baccharis salicifolia, B. latifolia and B. dracunculifolia, Phytochemistry, 1995, 38, 2, 381-389, https://doi.org/10.1016/0031-9422(94)00628-7 . [all data]

Menut, Molangui, et al., 1995
Menut, C.; Molangui, T.; Lamaty, G.E.; Bessière, J.-M.; Habimana, J.-B. Menut.; Molangui, T.; Lamaty, G.E.; Bessière, J.-M.; Habimana, J.-B., Aromatic plants of tropical Central Africa. 23. Chemical composition of leaf essential oils of Eucalyptus goniocalyx F. Muell. and Eucalyptus patens Benth. grown in Rwanda, J. Agric. Food Chem., 1995, 43, 5, 1267-1271, https://doi.org/10.1021/jf00053a026 . [all data]