Pyrazine, 2-methoxy-3-(2-methylpropyl)-

Normal alkane RI, non-polar column, temperature ramp

Data compiled by: NIST Mass Spectrometry Data Center, William E. Wallace, director

Column type CapillaryCapillaryCapillaryCapillaryCapillary
Active phase SE-54DB-5 MSHP-5 MSHP-5HP-5
Column length (m) 30.30.30.30.30.
Carrier gas  HeliumHeliumH2H2
Substrate
Column diameter (mm) 0.320.250.250.250.32
Phase thickness (μm) 0.250.250.250.250.25
Tstart (C) 0.50.50.50.45.
Tend (C) 200.220.230.280.230.
Heat rate (K/min) 6.3.4.4.3.
Initial hold (min) 2.2.4.2.1.
Final hold (min)  70.10.10.10.
I 1175.1178.1187.1186.1173.
ReferenceLaselan, Buettner, et al., 2009Shimizu, Imayoshi, et al., 2009Forero, Quijano, et al., 2008Pino, Sauri-Duch, et al., 2006Darriet, Pons, et al., 2002
Comment MSDC-RI MSDC-RI MSDC-RI MSDC-RI MSDC-RI
Column type CapillaryCapillaryCapillaryCapillaryCapillary
Active phase DB-1DB-5DB-5MSDB-5DB-5
Column length (m) 30.30.30.30.30.
Carrier gas HeHeHeHeH2
Substrate
Column diameter (mm) 0.250.320.320.320.32
Phase thickness (μm) 0.250.250.250.250.5
Tstart (C) 40.40.40.40.60.
Tend (C) 210.230.195.230.245.
Heat rate (K/min) 5.6.5.6.3.
Initial hold (min)  2.5.2.3.
Final hold (min)  5.40.5.20.
I 1163.1183.1174.1184.1195.
ReferenceKumazawa and Masuda, 2002Sanz, Czerny, et al., 2002Suriyaphan, Drake, et al., 2001Czerny and Grosch, 2000Kotseridis and Baumes, 2000
Comment MSDC-RI MSDC-RI MSDC-RI MSDC-RI MSDC-RI
Column type CapillaryCapillaryCapillaryCapillaryCapillary
Active phase DB-5OV-101Ultra-1OV-101DB-5
Column length (m) 30.10.50.15.30.
Carrier gas H2HeliumHeHeH2
Substrate
Column diameter (mm) 0.320.250.20.320.3
Phase thickness (μm) 0.50.52
Tstart (C) 60.35.40.35.80.
Tend (C) 245.225.240.250.250.
Heat rate (K/min) 3.6.4.6.16.
Initial hold (min) 3.3. 3.
Final hold (min) 20. 10.
I 1195.1160.1211.1175.1161.
ReferenceKotseridis and Baumes, 2000Deibler, Acree, et al., 1998Hashizume and Samuta, 1997Chisholm, Guiher, et al., 1995Spadone, Takeoka, et al., 1990
Comment MSDC-RI MSDC-RI MSDC-RI MSDC-RI MSDC-RI
Column type CapillaryCapillaryCapillaryCapillary
Active phase HP-5HP-5OV-101DB-5
Column length (m) 50.50.50.60.
Carrier gas H2H2 H2
Substrate
Column diameter (mm) 0.30.30.220.32
Phase thickness (μm)
Tstart (C) 80.80.80.40.
Tend (C) 250.250.200.200.
Heat rate (K/min) 16.16.2.2.
Initial hold (min)
Final hold (min)
I 1161.1185.1166.1184.
ReferenceSpadone, Takeoka, et al., 1990Spadone, Takeoka, et al., 1990Mihara and Masuda, 1988Gallois and Grimont, 1985
Comment MSDC-RI MSDC-RI MSDC-RI MSDC-RI

Normal alkane RI, non-polar column, custom temperature program

Data compiled by: NIST Mass Spectrometry Data Center, William E. Wallace, director

Column type CapillaryCapillaryCapillaryCapillaryCapillary
Active phase Polydimethyl siloxane with 5 % Ph groupsPolydimethyl siloxane with 5 % Ph groupsHP-5 MSHP-1DB-5
Column length (m)   60.50.30.
Carrier gas   HeliumHe
Substrate
Column diameter (mm)   0.320.20.32
Phase thickness (μm)   1.00.330.25
Program not specifiednot specified120 0C 2 0C/min -> 240 0C 10 0C/min -> 270 0C (2 min)40C(2min) => 2C/min => 200C => 15C/min => 250C (30min)40C(2min) => 40C/min => 60C(2min) => 6C/min => 180C => 15C/min => 230C(10min)
I 1179.1183.1193.1156.1184.
ReferenceRobinson, Adams, et al., 2012Robinson, Adams, et al., 2012Dharmawan, Kasapis, et al., 2009Barra, Baldovini, et al., 2007Buettner, 2007
Comment MSDC-RI MSDC-RI MSDC-RI MSDC-RI MSDC-RI
Column type CapillaryCapillaryCapillaryCapillaryCapillary
Active phase SE-54DB-5HP-5HP-5DB-1
Column length (m) 30.30.30.30.30.
Carrier gas  HeHeHeHe
Substrate
Column diameter (mm) 0.320.320.250.250.25
Phase thickness (μm) 0.250.250.250.250.25
Program 35C(2min) => 40C/min => 60C(2min) => 6C/min => 180C => 10C/min => 230C(10min)40 0C (2 min) 6 K/min -> 190 0C 12 K/min -> 240 0C50 C(1min) => 20C/min => 80C => 25C/min => 250C (3 min)50 C(1min) => 20C/min => 80C => 25C/min => 250C (3 min)60C => 4C/min => 200C (5min) => 10C/min => 280C (20min)
I 1175.1181.1185.1187.1176.
ReferenceLasekan, Buettner, et al., 2007Steinhaus and Schieberle, 2005Hartmann, 2003Hartmann, 2003Variyar, Ahmad, et al., 2003
Comment MSDC-RI MSDC-RI MSDC-RI MSDC-RI MSDC-RI
Column type CapillaryCapillaryCapillaryCapillaryCapillary
Active phase DB-5HP-5CP Sil 8 CBSE-54RSL-150
Column length (m) 30.30.60.30.60.
Carrier gas     He
Substrate
Column diameter (mm) 0.530.250.250.320.32
Phase thickness (μm) 1.50.250.250.250.25
Program -5C(1min) => 4C/min => 50C => 6C/min => 120C => 8C/min => 250C(2min)40C (5min) => 10C/min => 80C => 20C/min => 230C (5min)not specified35 0C (2 min) 40 0C/min -> 50 0C (1 min) 6 0C/min -> 230 0C30c (1.5min) => 20C/min => 55C => 6C/min => 200C(10min)
I 1186.1187.1186.1181.1164.
ReferenceBücking and Steinhart, 2002Hartmann, McNair, et al., 2002Duckham, Dodson, et al., 2001Reiners and Grosch, 1998Buchbauer, Nikiforov, et al., 1994
Comment MSDC-RI MSDC-RI MSDC-RI MSDC-RI MSDC-RI

References

Laselan, Buettner, et al., 2009
Laselan, P.; Buettner, A.; Christlbauer, M., Investigation of the retronasal perseption of palm wine (Elaeis guineensis) aroma by application of sensory analysis and exhaled odorant measurement (EXOM), African J. of Food, Agriculture, Nutrition and development, 2009, 9, 2, 793-813. [all data]

Shimizu, Imayoshi, et al., 2009
Shimizu, Y.; Imayoshi, Y.; Kato, M.; Maeda, K.; Iwabuchi, H.; Shimomura, K., Volatiles from leaves of field-grown plants and shoot cultures of Gynura bicolor DC, Flavour Fragr. J., 2009, 24, 5, 251-258, https://doi.org/10.1002/ffj.1938 . [all data]

Forero, Quijano, et al., 2008
Forero, M.D.; Quijano, C.E.; Pino, J.A., Volatile compounds of Chile pepper (Capsicum annuum L. var. glabriusculum) at two ripening stages, Flavour Fragr. J., 2008, 24, 1, 25-30, https://doi.org/10.1002/ffj.1913 . [all data]

Pino, Sauri-Duch, et al., 2006
Pino, J.; Sauri-Duch, E.; Marbot, R., Changes in volatile compounds of Habanero chile pepper (Capsicum chinense Jack. cv. Habanero) at two ripening stages, Food Chem., 2006, 94, 3, 394-398, https://doi.org/10.1016/j.foodchem.2004.11.040 . [all data]

Darriet, Pons, et al., 2002
Darriet, P.; Pons, M.; Henry, R.; Dumont, O.; Findeling, V.; Cartolaro, P.; Calonnec, A.; Dubourdieu, D., Impact odorants contributing to the fungus type aroma from grape berries contaminated by powdery mildew (Uncinula necator); incidence of enzymatic activities of the yeast Saccharomyces cerevisiae, J. Agric. Food Chem., 2002, 50, 11, 3277-3282, https://doi.org/10.1021/jf011527d . [all data]

Kumazawa and Masuda, 2002
Kumazawa, K.; Masuda, H., Identification of potent odorants in different green tea varieties using flavor dilution technique, J. Agric. Food Chem., 2002, 50, 20, 5660-5663, https://doi.org/10.1021/jf020498j . [all data]

Sanz, Czerny, et al., 2002
Sanz, C.; Czerny, M.; Cid, C.; Schieberle, P., Comparison of potent odorants in a filtered coffee brew and in an instant coffee beverage by aroma extract dilution analysis (AEDA), Eur. Food Res. Technol., 2002, 214, 4, 299-302, https://doi.org/10.1007/s00217-001-0459-9 . [all data]

Suriyaphan, Drake, et al., 2001
Suriyaphan, O.; Drake, M.; Chen, X.Q.; Cadwallader, K.R., Characteristic aroma components of British farmhouse cheddar cheese, J. Agric. Food Chem., 2001, 49, 3, 1382-1387, https://doi.org/10.1021/jf001121l . [all data]

Czerny and Grosch, 2000
Czerny, M.; Grosch, W., Potent odorants of raw Arabica coffee. Their changes during roasting, J. Agric. Food Chem., 2000, 48, 3, 868-872, https://doi.org/10.1021/jf990609n . [all data]

Kotseridis and Baumes, 2000
Kotseridis, Y.; Baumes, R., Identification of impact odorants in Bordeaux red grape juice, in the commercial yeast used for its fermentation, and in the produced wine, J. Agric. Food Chem., 2000, 48, 2, 400-406, https://doi.org/10.1021/jf990565i . [all data]

Deibler, Acree, et al., 1998
Deibler, K.D.; Acree, T.E.; Lavin, E.H., Aroma analysis of coffrr brew by gas chromatography-oldfactometry, Developments in Food Sci., 1998, 40, 69-78. [all data]

Hashizume and Samuta, 1997
Hashizume, K.; Samuta, T., Green odorants of grape cluster stem and their ability to cause a wine stemmy flavor, J. Agric. Food Chem., 1997, 45, 4, 1333-1337, https://doi.org/10.1021/jf960635a . [all data]

Chisholm, Guiher, et al., 1995
Chisholm, M.G.; Guiher, L.A.; Zaczkiewicz, S.M., Aroma characteristics of aged Vidal blanc wine, Am. J. Enol. Vitic, 1995, 46, 1, 56-62. [all data]

Spadone, Takeoka, et al., 1990
Spadone, J.-C.; Takeoka, G.; Liardon, R., Analytical Investigation of Rio Off-Flavor in Green Coffee, J. Agric. Food Chem., 1990, 38, 1, 226-233, https://doi.org/10.1021/jf00091a050 . [all data]

Mihara and Masuda, 1988
Mihara, S.; Masuda, H., Structure-odor relationships for disubstituted pyrazines, J. Agric. Food Chem., 1988, 36, 6, 1242-1247, https://doi.org/10.1021/jf00084a029 . [all data]

Gallois and Grimont, 1985
Gallois, A.; Grimont, P.A.D., Pyrazines responsible for the potatolike odor produced by some Serratia and Cedecea strains, Appl. Environ. Microbiol., 1985, 10, 1048-1051. [all data]