Pentane, 1,1,1,5-tetrachloro-

Kovats' RI, non-polar column, isothermal

Data compiled by: NIST Mass Spectrometry Data Center, William E. Wallace, director

Column type Capillary
Active phase E-301
Column length (m)
Carrier gas
Substrate
Column diameter (mm)
Phase thickness (μm)
Temperature (C) 150.
I 1220.
ReferenceKudryavtseva, Fatalieva, et al., 1972
Comment MSDC-RI

References

Kudryavtseva, Fatalieva, et al., 1972
Kudryavtseva, N.A.; Fatalieva, A.A.; Lulova, N.I.; Vinogradova, I.E., Methods of assessing fuel and oil quality. Use of gas chromatography to identify components of decomposition products from Sul'fol antiscuff additive, Chem. Technol. Fuels Oils (Engl. Transl.), 1972, 8, 10, 786-790, https://doi.org/10.1007/BF00717079 . [all data]