Ergosta-7,22-dien-3-ol, (3β,5α,22E)-

Normal alkane RI, non-polar column, temperature ramp

View large format table.

Column type Active phase I Reference Comment
CapillaryDB-5 MS3202.Radulovic and Dordevic, 201130. m/0.25 mm/0.25 μm, Helium, 5. K/min, 315. C @ 10. min; Tstart: 70. C

References

Radulovic and Dordevic, 2011
Radulovic, N.S.; Dordevic, N.D., Sterods from poison hemlock (Conium maculatum L.): a GC-MS analysis, J. Serb. Chem. Soc., 2011, 76, 11, 1471-1483, https://doi.org/10.2298/JSC110206128R . [all data]