2-Undecenal

Kovats' RI, non-polar column, temperature ramp

Data compiled by: NIST Mass Spectrometry Data Center, William E. Wallace, director

Column type CapillaryCapillaryCapillaryCapillary
Active phase DB-1DB-1DB-5DB-5
Column length (m) 60.60.30.30.
Carrier gas   HeHe
Substrate
Column diameter (mm) 0.250.250.130.13
Phase thickness (μm) 0.250.25
Tstart (C) 30.30.30.30.
Tend (C) 220.220.280.280.
Heat rate (K/min) 2.2.10.10.
Initial hold (min) 4.4.2.2.
Final hold (min)   3.3.
I 1339.1346.1376.1376.
ReferenceTakeoka, Perrino, et al., 1996Takeoka, Perrino, et al., 1996Ramarathnam, Rubin, et al., 1993Ramarathnam, Rubin, et al., 1993, 2
Comment MSDC-RI MSDC-RI MSDC-RI MSDC-RI

References

Takeoka, Perrino, et al., 1996
Takeoka, G.; Perrino, C., Jr.; Buttery, R., Volatile constituents of used frying oils, J. Agric. Food Chem., 1996, 44, 3, 654-660, https://doi.org/10.1021/jf950430m . [all data]

Ramarathnam, Rubin, et al., 1993
Ramarathnam, N.; Rubin, L.J.; Diosady, L.L., Studies on meat flavor. 3. A novel method for trapping volatile components from uncured and cured pork, J. Agric. Food Chem., 1993, 41, 6, 933-938, https://doi.org/10.1021/jf00030a019 . [all data]

Ramarathnam, Rubin, et al., 1993, 2
Ramarathnam, N.; Rubin, L.J.; Diosady, L.L., Studies on meat flavor. 4. Fractionation, characterization, and quantitation of volatiles from uncured and cured beef and chicken, J. Agric. Food Chem., 1993, 41, 6, 939-945, https://doi.org/10.1021/jf00030a020 . [all data]