2-Heptenal

Van Den Dool and Kratz RI, polar column, temperature ramp

Data compiled by: NIST Mass Spectrometry Data Center, William E. Wallace, director

Column type CapillaryCapillaryCapillaryCapillary
Active phase DB-WaxCP-Wax 52CBCP-Wax 52CBCP-Wax 52CB
Column length (m) 60.50.50.50.
Carrier gas He
Substrate
Column diameter (mm) 0.320.320.320.32
Phase thickness (μm) 0.5
Tstart (C) 30.60.60.60.
Tend (C) 160.220.220.220.
Heat rate (K/min) 3.4.4.4.
Initial hold (min)  5.5.5.
Final hold (min) 5.30.30.30.
I 1352.1321.1320.1313.
ReferenceBeauchene, Grua-Priol, et al., 2000Chevance, Farmer, et al., 2000Chevance and Farmer, 1999Chevance and Farmer, 1999, 2
Comment MSDC-RI MSDC-RI MSDC-RI MSDC-RI

Normal alkane RI, non-polar column, isothermal

Data compiled by: NIST Mass Spectrometry Data Center, William E. Wallace, director

Column type CapillaryPacked
Active phase OV-101Squalane
Column length (m) 30.1.
Carrier gas He
Substrate  Celite (80-100 mesh)
Column diameter (mm) 0.25
Phase thickness (μm)
Temperature (C) 120.75.
I 941.909.
ReferenceKenndler, Jenner, et al., 1985Swoboda and Lea, 1965
Comment MSDC-RI MSDC-RI

Normal alkane RI, polar column, temperature ramp

Data compiled by: NIST Mass Spectrometry Data Center, William E. Wallace, director

Column type CapillaryCapillaryCapillaryCapillaryCapillary
Active phase HP-InnowaxDB-WaxRTX-WaxDB-WaxDB-Wax
Column length (m) 60.30.60.60.30.
Carrier gas HeliumHeliumHe H2
Substrate
Column diameter (mm) 0.250.250.250.25
Phase thickness (μm) 0.250.250.5 0.25
Tstart (C) 60.60.40.30.60.
Tend (C) 220.250.180.170.230.
Heat rate (K/min) 3.10.5.2.8.
Initial hold (min) 1.2.5.4.5.
Final hold (min) 5.10.20.30.10.
I 1333.1334.1349.1320.1336.
ReferenceFeng, Zhuang, et al., 2011Guo, Wu, et al., 2008Galindo-Cuspinera, Lubran, et al., 2002Buttery and Ling, 1998Steullet and Guerin, 1994
Comment MSDC-RI MSDC-RI MSDC-RI MSDC-RI MSDC-RI
Column type CapillaryCapillaryCapillaryCapillaryCapillary
Active phase DB-WaxDB-WaxDB-WaxDB-WaxDB-Wax
Column length (m) 30.30.30.30.30.
Carrier gas H2HeHeHeHe
Substrate
Column diameter (mm)  0.250.250.250.25
Phase thickness (μm) 0.250.250.250.250.25
Tstart (C) 60.60.60.60.60.
Tend (C) 230.230.230.230.230.
Heat rate (K/min) 8.8.8.8.8.
Initial hold (min) 5.5.5.5.5.
Final hold (min) 10.10.10.10.10.
I 1338.1336.1336.1337.1338.
ReferenceSteullet and Guerin, 1994Steullet and Guerin, 1994Steullet and Guerin, 1994Steullet and Guerin, 1994Steullet and Guerin, 1994
Comment MSDC-RI MSDC-RI MSDC-RI MSDC-RI MSDC-RI

Kovats' RI, polar column, isothermal

Data compiled by: NIST Mass Spectrometry Data Center, William E. Wallace, director

Column type Packed
Active phase Carbowax 4000
Column length (m) 10.
Carrier gas N2
Substrate GAS Chrom P
Column diameter (mm)
Phase thickness (μm)
Temperature (C) 140.
I 1364.
ReferenceMinyard, Tumlinson, et al., 1967
Comment MSDC-RI

References

Beauchene, Grua-Priol, et al., 2000
Beauchene, D.; Grua-Priol, J.; Lamer, T.; Demaimay, M.; Quemeneur, F., Concentration by pervaporation of aroma compounds from Fucus serratus, J. Sci. Food Agric., 2000, 75, 451-458. [all data]

Chevance, Farmer, et al., 2000
Chevance, F.F.V.; Farmer, L.J.; Desmond, E.M.; Novelli, E.; Troy, D.J.; Chizzolini, R., Effect of some fat replacers on the release of volatile aroma compounds from low-fat meat products, J. Agric. Food Chem., 2000, 48, 8, 3476-3484, https://doi.org/10.1021/jf991211u . [all data]

Chevance and Farmer, 1999
Chevance, F.F.V.; Farmer, L.J., Identification of major volatile odor compounds in frankfurters, J. Agric. Food Chem., 1999, 47, 12, 5151-5160, https://doi.org/10.1021/jf990515d . [all data]

Chevance and Farmer, 1999, 2
Chevance, F.F.V.; Farmer, L.J., Release of volatile odor compounds from full-fat and reduced-fat frankfurters, J. Agric. Food Chem., 1999, 47, 12, 5161-5168, https://doi.org/10.1021/jf9905166 . [all data]