2-Nonenal

Normal alkane RI, non-polar column, temperature ramp

Data compiled by: NIST Mass Spectrometry Data Center, William E. Wallace, director

Column type CapillaryCapillaryCapillaryCapillaryCapillary
Active phase HP-5MSDB-5DB-1HP-5 MS5 % Phenyl methyl siloxane
Column length (m) 30.60.30.30.0.
Carrier gas HeHeHeHeliumHe
Substrate
Column diameter (mm) 0.250.320.250.250.25
Phase thickness (μm) 0.25 0.250.251.
Tstart (C) 60.60.50.60.40.
Tend (C) 250.250.265.250.250.
Heat rate (K/min) 2.4.2.52.7.
Initial hold (min) 8.5.1.8.10.
Final hold (min) 15. 20.15.5.
I 1154.1170.1127.1154.1160.
ReferenceFerhat, Tigrine-Kordjani, et al., 2007Fadel, Mageed, et al., 2006Iranshahi, Amin, et al., 2006Tigrine-Kordiani, Meklati, et al., 2006Ramírez, Estévez, et al., 2004
Comment MSDC-RI MSDC-RI MSDC-RI MSDC-RI MSDC-RI
Column type CapillaryCapillaryCapillaryCapillaryCapillary
Active phase SPB-5HP-5HP-5DB-5DB-5
Column length (m) 60.60.50.60.60.
Carrier gas HeliumHe
Substrate
Column diameter (mm) 0.320.320.320.320.32
Phase thickness (μm) 1.01.0.521.1.
Tstart (C) 30.40.35.40.40.
Tend (C) 230.240.250.200.200.
Heat rate (K/min) 3.3.2.3.3.
Initial hold (min)   15.5.5.
Final hold (min)   45.2.2.
I 1161.1165.1161.1160.1162.
ReferenceSebastian, Viallon-Fernandez, et al., 2003García, Martín, et al., 2000Boylston and Viniyard, 1998Kondjoyan, Viallon, et al., 1997Kondjoyan, Viallon, et al., 1997
Comment MSDC-RI MSDC-RI MSDC-RI MSDC-RI MSDC-RI
Column type CapillaryCapillaryCapillaryCapillaryCapillary
Active phase Ultra-2Cross-Linked MethylsiliconeUltra-2Methyl SiliconeDB-5
Column length (m) 50.25.50.17.60.
Carrier gas HeHeHeHeHe
Substrate
Column diameter (mm) 0.320.320.320.320.32
Phase thickness (μm) 0.52 0.52 1.0
Tstart (C) 40.35.40.35.40.
Tend (C) 250.225.250.225.240.
Heat rate (K/min) 4.4.4.4.3.
Initial hold (min) 3.3.3.3.
Final hold (min) 30. 30.
I 1155.1134.1163.1137.1158.
ReferenceKing, Matthews, et al., 1995Bravo and Hotchkiss, 1993King, Hamilton, et al., 1993Bravo, Hotchkiss, et al., 1992Berdague, Denoyer, et al., 1991
Comment MSDC-RI MSDC-RI MSDC-RI MSDC-RI MSDC-RI
Column type CapillaryCapillaryCapillaryCapillaryCapillary
Active phase HG-5DB-5DB-5HP-5HP-5
Column length (m) 50.60.30.50.50.
Carrier gas HeHeH2H2H2
Substrate
Column diameter (mm) 0.320.250.30.30.3
Phase thickness (μm) 0.52
Tstart (C) 35.40.80.80.80.
Tend (C) 250.160.250.250.250.
Heat rate (K/min) 3.2.16.16.16.
Initial hold (min) 15.5.
Final hold (min) 45.
I 1164.1164.1135.1146.1163.
ReferenceDrumm and Spanier, 1991Macku and Shibamoto, 1991Spadone, Takeoka, et al., 1990Spadone, Takeoka, et al., 1990Spadone, Takeoka, et al., 1990
Comment MSDC-RI MSDC-RI MSDC-RI MSDC-RI MSDC-RI
Column type CapillaryCapillaryCapillary
Active phase SE-54DB-1DB-1
Column length (m) 25.50.50.
Carrier gas N2
Substrate
Column diameter (mm) 0.250.320.32
Phase thickness (μm)
Tstart (C) 60.0.50.
Tend (C) 260.250.250.
Heat rate (K/min) 6.3.3.
Initial hold (min) 2.
Final hold (min)
I 1154.1133.1132.
ReferenceBestmann, Classen, et al., 1988Habu, Flath, et al., 1985Habu, Flath, et al., 1985
Comment MSDC-RI MSDC-RI MSDC-RI

Normal alkane RI, non-polar column, custom temperature program

Data compiled by: NIST Mass Spectrometry Data Center, William E. Wallace, director

Column type CapillaryCapillaryCapillaryCapillaryCapillary
Active phase SLB-5 MSSLB-5 MSOV-1DB-1DB-1
Column length (m) 30.30.30.60.60.
Carrier gas HeliumHeliumHeliumN2He
Substrate
Column diameter (mm) 0.250.250.250.250.32
Phase thickness (μm) 0.250.25 0.250.25
Program not specifiednot specified40 0C 2 0C/min -> 130 0C (5 min) 10 0C/min -> 230 0C (15 min)40C(1min) => 5C/min => 150C => 10C/min => 200C(9min)33C(5min) => 2C/min => 50c => 5C/min => 225C
I 1163.1164.1124.1135.1123.
ReferenceMondello, 2012Mondello, 2012Yu, Li, et al., 2009Lin, Peng, et al., 2007Cramer, Mattinson, et al., 2005
Comment MSDC-RI MSDC-RI MSDC-RI MSDC-RI MSDC-RI
Column type CapillaryCapillaryCapillaryCapillaryCapillary
Active phase BPX-5MDN-5MDN-5DB-5RTX-5 MS
Column length (m) 60.30.30.60.60.
Carrier gas HeHeliumHelium He
Substrate
Column diameter (mm) 0.320.250.250.250.25
Phase thickness (μm) 1.0.250.250.250.5
Program 40C (4min) => 2C/min => 90C => 4C/min => 130C => 8C/min => 250 C (10min)30 0C (1 min) ballistically -> 60 0C 2 0C/min -> 120 0C 5 0C/min -> 280 0C (5 min)35 0C (1 min) 120 0C/min -> 60 0C 2 0C/min -> 280 0C35C => 5C/min => 120C => 2C/min => 160C => 7C/min => 250C35C (3min) => 10C/min => 50C => 4C/min => 200C => 50C/min => 250C (10min)
I 1148.1127.1124.1161.1167.
ReferenceMachiels, Istasse, et al., 2004Moretti, Madonia, et al., 2004Turchimi, Mentasti, et al., 2004Chung, Heymann, et al., 2003Machiels and Istasse, 2003
Comment MSDC-RI MSDC-RI MSDC-RI MSDC-RI MSDC-RI
Column type CapillaryCapillaryCapillaryCapillary
Active phase CP Sil 8 CBMethyl SiliconeSE-54SE-54
Column length (m) 60. 50.50.
Carrier gas   He
Substrate
Column diameter (mm) 0.25 0.320.32
Phase thickness (μm) 0.25
Program not specifiednot specified35 0C (5 min) 8 0C/min -> 200 0C 2 0C/min -> 250 0C35C(5min) => 8C/min => 200C => 2C/min => 250C
I 1173.1130.1168.1160.
ReferenceDuckham, Dodson, et al., 2001Misharina, 1995Um, Bailey, et al., 1992Suzuki and Bailey, 1985
Comment MSDC-RI MSDC-RI MSDC-RI MSDC-RI

Van Den Dool and Kratz RI, non-polar column, temperature ramp

Data compiled by: NIST Mass Spectrometry Data Center, William E. Wallace, director

Column type CapillaryCapillaryCapillaryCapillaryCapillary
Active phase HP-5MSHP-5CP Sil 8 CBCP-Sil 8CB-MSHP-5MS
Column length (m) 30.30.60.60.30.
Carrier gas HeHeHe He
Substrate
Column diameter (mm) 0.250.250.250.250.25
Phase thickness (μm) 0.250.250.250.250.25
Tstart (C) 80.60.40.40.60.
Tend (C) 300.250.250.280.280.
Heat rate (K/min) 4.10.4.4.4.
Initial hold (min)  2.8.2.5.
Final hold (min)  10.10.
I 1159.41168.1159.1165.1158.
ReferenceZhao C.X., Li, et al., 2006Zhao J.Y., Liu J.M., et al., 2006Oruna-Concha, Ames, et al., 2002Bruna, Hierro, et al., 2001Skaltsa, Mavrommati, et al., 2001
Comment MSDC-RI MSDC-RI MSDC-RI MSDC-RI MSDC-RI
Column type CapillaryCapillaryCapillaryPackedPacked
Active phase DB-1Methyl SiliconeDB-5OV-101Apiezon M
Column length (m) 30.25.30.2.51.5
Carrier gas  HeHe N2
Substrate    Gas-Chrom QCelite 545
Column diameter (mm) 0.250.20.25
Phase thickness (μm) 1.0.3
Tstart (C) -50.40.50.50.75.
Tend (C) 180.200.250.220.200.
Heat rate (K/min) 6.2.4.2.6.
Initial hold (min)
Final hold (min)
I 1135.1144.1159.1130.1131.
ReferenceHelmig, Pollock, et al., 1996Píry, Príbela, et al., 1995Gómez, Ledbetter, et al., 1993Nixon, Wong, et al., 1979Golovnya and Uraletz, 1971
Comment MSDC-RI MSDC-RI MSDC-RI MSDC-RI MSDC-RI
Column type PackedPacked
Active phase Apiezon MApiezon M
Column length (m) 1.51.5
Carrier gas N2N2
Substrate Celite 545Celite 545
Column diameter (mm)
Phase thickness (μm)
Tstart (C) 75.75.
Tend (C) 200.200.
Heat rate (K/min) 6.6.
Initial hold (min)
Final hold (min)
I 1136.1138.
ReferenceGolovnya and Uraletz, 1971Golovnya and Uraletz, 1971
Comment MSDC-RI MSDC-RI

Normal alkane RI, polar column, temperature ramp

Data compiled by: NIST Mass Spectrometry Data Center, William E. Wallace, director

Column type CapillaryCapillaryCapillaryCapillaryCapillary
Active phase StabilwaxCarbowaxCarbowax-PEGStabilwaxSupelcowax-10
Column length (m) 60.60.60.60.60.
Carrier gas HeliumHeHeliumHeliumHe
Substrate
Column diameter (mm) 0.250.20.200.250.25
Phase thickness (μm) 0.250.250.250.250.25
Tstart (C) 40.60.60.40.35.
Tend (C) 240.250.250.240.200.
Heat rate (K/min) 3.2.2.3.4.
Initial hold (min) 5.8.8.5.10.
Final hold (min) 10.15.15.10.
I 1534.1540.1540.1534.1541.
ReferenceCros, Vandanjon, et al., 2007Ferhat, Tigrine-Kordjani, et al., 2007Tigrine-Kordiani, Meklati, et al., 2006Cros, Vandanjon, et al., 2003Girard and Durance, 2000
Comment MSDC-RI MSDC-RI MSDC-RI MSDC-RI MSDC-RI
Column type CapillaryCapillaryCapillary
Active phase DB-WaxDB-WaxInnowax
Column length (m) 30.30.30.
Carrier gas
Substrate
Column diameter (mm) 0.530.530.25
Phase thickness (μm)   0.25
Tstart (C) 60.60.40.
Tend (C) 210.210.240.
Heat rate (K/min) 4.4.6.
Initial hold (min)   10.
Final hold (min)   25.
I 1546.1546.1535.
ReferenceIwatsuki, Mizota, et al., 1999Iwatsuki, Mizota, et al., 1999Petersen, Poll, et al., 1998
Comment MSDC-RI MSDC-RI MSDC-RI

Van Den Dool and Kratz RI, polar column, custom temperature program

Data compiled by: NIST Mass Spectrometry Data Center, William E. Wallace, director

Column type CapillaryCapillaryCapillary
Active phase FFAPCP-Wax 52CBDB-Wax
Column length (m) 60.60.60.
Carrier gas HeHeHe
Substrate
Column diameter (mm) 0.250.250.25
Phase thickness (μm) 0.50.25
Program 50C(3min) => 3C/min => 100C => 10C/min => 220C(13.5min)45C(5min) => 10C/min => 80C => 2C/min => 240C45C(4min) => 30C/min => 60C (5min) => 3C/min => 220C (40min)
I 1568.1540.1537.
ReferenceRanau, Kleeberg, et al., 2005Verzera, Ziino, et al., 2004Ziegleder, 2001
Comment MSDC-RI MSDC-RI MSDC-RI

Kovats' RI, polar column, temperature ramp

Data compiled by: NIST Mass Spectrometry Data Center, William E. Wallace, director

Column type Capillary
Active phase Carbowax 20M
Column length (m) 50.
Carrier gas He
Substrate
Column diameter (mm) 0.28
Phase thickness (μm)
Tstart (C) 70.
Tend (C) 190.
Heat rate (K/min) 2.
Initial hold (min)
Final hold (min)
I 1524.
ReferenceTressl, Friese, et al., 1978
Comment MSDC-RI

References

Ferhat, Tigrine-Kordjani, et al., 2007
Ferhat, M.A.; Tigrine-Kordjani, N.; Chemat, S.; Meklati, B.Y.; Chemat, F., Rapid Extraction of Volatile Compounds Using a New Simultaneous Microwave Distillation: Solvent Extraction Device, Chromatographia, 2007, 65, 3-4, 217-222, https://doi.org/10.1365/s10337-006-0130-5 . [all data]

Fadel, Mageed, et al., 2006
Fadel, H.H.M.; Mageed, M.A.A.; Lotfy, S.N., Quality and flavour stability of coffee substitute prepared by extrusion of wheat germ and chicory roots, Amino Acids, 2006, https://doi.org/10.1007/s007260200008 . [all data]

Iranshahi, Amin, et al., 2006
Iranshahi, M.; Amin, G.; Sourmaghi, M.S.; Shafiee, A.; Hadjiakhoondi, A., Sulphur-containing compounds in the essential oil of the root of Ferula persica Willd. var. persica, Flavour Fragr. J., 2006, 21, 2, 260-261, https://doi.org/10.1002/ffj.1574 . [all data]

Tigrine-Kordiani, Meklati, et al., 2006
Tigrine-Kordiani, N.; Meklati, B.Y.; Chemat, F., Abalysis by gas chromatography - mass spectrometry of the essential oil of Zygophyllum album L., an aromatic and medicinal plant growing in Algeria, Int. J. Aromatherapy, 2006, 16, 3-4, 187-191, https://doi.org/10.1016/j.ijat.2006.09.008 . [all data]

Ramírez, Estévez, et al., 2004
Ramírez, M.R.; Estévez, M.; Morcuende, D.; Cava, R., Effect of the type of frying culinary fat on volatile compounds isolated in fried pork loin chops by using SPME-GC-MS, J. Agric. Food Chem., 2004, 52, 25, 7637-7643, https://doi.org/10.1021/jf049207s . [all data]

Sebastian, Viallon-Fernandez, et al., 2003
Sebastian, I.; Viallon-Fernandez, C.; Berge, P.; Berdague, J.-L., Analysis of the volatile fraction of lamb fat tissue: influence of the type of feeding, Sciences des Aliments, 2003, 23, 4, 497-511, https://doi.org/10.3166/sda.23.497-511 . [all data]

García, Martín, et al., 2000
García, C.; Martín, A.; Timón, M.L.; Córdoba, J.J., Microbial populations and volatile compounds in the 'bone taint' spoilage of dry cured ham, Lett. Appl. Microbiol., 2000, 30, 1, 61-66, https://doi.org/10.1046/j.1472-765x.2000.00663.x . [all data]

Boylston and Viniyard, 1998
Boylston, T.D.; Viniyard, B.T., Isolation of volatile flavor compounds from peanut butter using purge-and-trap technique in Instrumental Methods in Food and Beverage Analysis, D. Wetzel and G. Charalambous, ed(s)., 1998, 225-243. [all data]

Kondjoyan, Viallon, et al., 1997
Kondjoyan, N.; Viallon, C.; Berdagué, J.L.; Daridan, D.; Simon, M.-N.; Legault, C., Analyse comparative de la fraction volatile de jambons secs de porcs Gascon et Large-White x Landrace Français, J. Rech. C.N.R.S., 1997, 29, 405-410, retrieved from http://www.rennes.inra.fr/srp/jrp/1997/97txtQualite/Q9704.pdf. [all data]

King, Matthews, et al., 1995
King, M.-F.; Matthews, M.A.; Rule, D.C.; Field, R.A., Effect of beef packaging method on volatile compounds developed by oven roasting or microwave cooking, J. Agric. Food Chem., 1995, 43, 3, 773-778, https://doi.org/10.1021/jf00051a039 . [all data]

Bravo and Hotchkiss, 1993
Bravo, A.; Hotchkiss, J.H., Identification of volatile compounds resulting from the thermal oxidation of polyethylene, J. Appl. Polym. Sci., 1993, 47, 10, 1741-1748, https://doi.org/10.1002/app.1993.070471004 . [all data]

King, Hamilton, et al., 1993
King, M.-F.; Hamilton, B.L.; Matthews, M.A.; Rule, D.C.; Field, R.A., Isolation and identification of volatiles and condensable material in raw beef with supercritical carbon dioxide extraction, J. Agric. Food Chem., 1993, 41, 11, 1974-1981, https://doi.org/10.1021/jf00035a030 . [all data]

Bravo, Hotchkiss, et al., 1992
Bravo, A.; Hotchkiss, J.H.; Acree, T.E., Identification of ordor-active compounds resulting from thermal oxidation of polyethylene, J. Agric. Food Chem., 1992, 40, 10, 1881-1885, https://doi.org/10.1021/jf00022a031 . [all data]

Berdague, Denoyer, et al., 1991
Berdague, J.-L.; Denoyer, C.; Le Quéré, J.-L.; Semon, E., Volatile components of dry-cured ham, J. Agric. Food Chem., 1991, 39, 7, 1257-1261, https://doi.org/10.1021/jf00007a012 . [all data]

Drumm and Spanier, 1991
Drumm, T.D.; Spanier, A.M., Changes in the content of lipid autoxidation and sulfur-containing compounds in cooked beef during storage, J. Agric. Food Chem., 1991, 39, 2, 336-343, https://doi.org/10.1021/jf00002a023 . [all data]

Macku and Shibamoto, 1991
Macku, C.; Shibamoto, T., Headspace volatile compounds formed from heated corn oil and corn oil with glycine, J. Agric. Food Chem., 1991, 39, 7, 1265-1269, https://doi.org/10.1021/jf00007a014 . [all data]

Spadone, Takeoka, et al., 1990
Spadone, J.-C.; Takeoka, G.; Liardon, R., Analytical Investigation of Rio Off-Flavor in Green Coffee, J. Agric. Food Chem., 1990, 38, 1, 226-233, https://doi.org/10.1021/jf00091a050 . [all data]

Bestmann, Classen, et al., 1988
Bestmann, H.-J.; Classen, B.; Kobold, U.; Vostrowsky, O.; Klingauf, F.; Stein, U., Steam volatile constituents from leaves of Rhus typhina, Phytochemistry, 1988, 27, 1, 85-90, https://doi.org/10.1016/0031-9422(88)80595-8 . [all data]

Habu, Flath, et al., 1985
Habu, T.; Flath, R.A.; Mon, T.R.; Morton, J.F., Volatile components of Rooibos tea (Aspalathus linearis), J. Agric. Food Chem., 1985, 33, 2, 249-254, https://doi.org/10.1021/jf00062a024 . [all data]