Zirconium bromide

Gas phase thermochemistry data

Quantity Value Units Method Reference Comment
Δfgas-174.47kJ/molReviewChase, 1998Data last reviewed in June, 1970
Quantity Value Units Method Reference Comment
gas,1 bar316.78J/mol*KReviewChase, 1998Data last reviewed in June, 1970

Gas Phase Heat Capacity (Shomate Equation)

Cp° = A + B*t + C*t2 + D*t3 + E/t2
H° − H°298.15= A*t + B*t2/2 + C*t3/3 + D*t4/4 − E/t + F − H
S° = A*ln(t) + B*t + C*t2/2 + D*t3/3 − E/(2*t2) + G
    Cp = heat capacity (J/mol*K)
    H° = standard enthalpy (kJ/mol)
    S° = standard entropy (J/mol*K)
    t = temperature (K) / 1000.

View plot Requires a JavaScript / HTML 5 canvas capable browser.

View table.

Temperature (K) 2000. - 6000.
A 46.96080
B 11.87340
C -2.028643
D 0.126651
E 5.759945
F -177.5832
G 383.4167
H -174.4732
ReferenceChase, 1998
Comment Data last reviewed in June, 1970

References

Chase, 1998
Chase, M.W., Jr., NIST-JANAF Themochemical Tables, Fourth Edition, J. Phys. Chem. Ref. Data, Monograph 9, 1998, 1-1951. [all data]