Glycidyl butyrate

Gas phase thermochemistry data

Data compiled by: Hussein Y. Afeefy, Joel F. Liebman, and Stephen E. Stein

Quantity Value Units Method Reference Comment
Δfgas-501.7 ± 2.8kJ/molCcbVan-Chin-Syan and Kachurina, 1987

Condensed phase thermochemistry data

Data compiled by: Hussein Y. Afeefy, Joel F. Liebman, and Stephen E. Stein

Quantity Value Units Method Reference Comment
Δfliquid-560.4 ± 4.2kJ/molCcbDmitriev, Kachurina, et al., 1986
Quantity Value Units Method Reference Comment
Δcliquid-3909.2 ± 4.2kJ/molCcbDmitriev, Kachurina, et al., 1986Corresponding Δfliquid = -560.4 kJ/mol (simple calculation by NIST; no Washburn corrections)

Phase change data

Data compiled as indicated in comments:
AC - William E. Acree, Jr., James S. Chickos
ALS - Hussein Y. Afeefy, Joel F. Liebman, and Stephen E. Stein

Quantity Value Units Method Reference Comment
Δvap58.7 ± 0.4kJ/molN/AVan-Chin-Syan and Kachurina, 1987, 2AC
Δvap58.67 ± 0.35kJ/molVVan-Chin-Syan and Kachurina, 1987ALS
Δvap58.0 ± 0.42kJ/molCDmitriev, Kachurina, et al., 1986ALS
Δvap58.0 ± 0.4kJ/molCYerlett and Wormald, 1986AC

References

Van-Chin-Syan and Kachurina, 1987
Van-Chin-Syan, Yu.Ya.; Kachurina, N.S., Thermochemical properties of oxirane derivatives, Russ. J. Phys. Chem. (Engl. Transl.), 1987, 61, 622-624. [all data]

Dmitriev, Kachurina, et al., 1986
Dmitriev, Yu.G.; Kachurina, N.S.; Wang, C.H.; Kochubei, V.V., Thermochemical properties of complex glycidol esters, Vestn. L'vov. Politekh. Inst., 1986, 201, 29-30. [all data]

Van-Chin-Syan and Kachurina, 1987, 2
Van-Chin-Syan, Yu.Ya.; Kachurina, N.S., Russ. J. Phys. Chem., 1987, 61, 622. [all data]

Yerlett and Wormald, 1986
Yerlett, T.K.; Wormald, C.J., The enthalpy of acetone, The Journal of Chemical Thermodynamics, 1986, 18, 4, 371-379, https://doi.org/10.1016/0021-9614(86)90083-2 . [all data]