cis,cis-1,3,5-tri-tert-butylcyclohexane

Phase change data

Data compiled by: William E. Acree, Jr., James S. Chickos

Enthalpy of fusion

ΔfusH (kJ/mol) Temperature (K) Reference
26.78393.2van Bekkum, Hoefnagel, et al., 2010

References

van Bekkum, Hoefnagel, et al., 2010
van Bekkum, H.; Hoefnagel, M.A.; de Lavieter, L.; van Veen, A.; Verkade, P.E.; Wemmers, A.; Wepster, B.M.; Palm, J.H.; Schäfer, L.; Dekker, H.; Mosselman, C.; Somsen, G., Studies on cyclohexane derivatives. Part VI: cis- and trans-1,4-Di-t-butylcyclohexane. Preparation and properties, Recl. Trav. Chim. Pays-Bas, 2010, 86, 12, 1363-1371, https://doi.org/10.1002/recl.19670861213 . [all data]