Propamocarb

Van Den Dool and Kratz RI, non-polar column, temperature ramp

View large format table.

Column type Active phase I Reference Comment
CapillarySLB-5MS1393.Mondello, Casilli, et al., 200730. m/0.25 mm/0.25 μm, He, 2. K/min; Tstart: 70. C; Tend: 300. C
CapillarySLB-5MS1399.Mondello, Casilli, et al., 200730. m/0.25 mm/0.25 μm, He, 2. K/min; Tstart: 70. C; Tend: 300. C

References

Mondello, Casilli, et al., 2007
Mondello, L.; Casilli, A.; Tranchida, P.Q.; Presti, M.L.; Dugo, P.; Dugo, G., Comprehensive gas chromatography coupled to mass spectrometry for the separation of pesticides in a very complex matrix, Anal. Bioanal. Chem., 2007, 389, 6, 1755-1763, https://doi.org/10.1007/s00216-007-1412-y . [all data]