Dispiro[2.2.2.2]decane

Gas phase ion energetics data

Data compiled as indicated in comments:
LLK - Sharon G. Lias, Rhoda D. Levin, and Sherif A. Kafafi

Ionization energy determinations

IE (eV) Method Reference Comment
9.17PEAsmus, Klessinger, et al., 1975Vertical value; LLK

References

Asmus, Klessinger, et al., 1975
Asmus, P.; Klessinger, M.; Meyer, L.-U.; deMeijere, A., Conjugative interaction between cyclopropyl walsh orbitals and π-orbitals in dispiro[2.2.2.2]deca-4,9-diene, Tetrahedron Lett., 1975, 6, 381. [all data]