Hexanedioic acid, bis(phenylmethyl) ester

Van Den Dool and Kratz RI, non-polar column, temperature ramp

View large format table.

Column type Active phase I Reference Comment
Capillary5 % Phenyl methyl siloxane2616.Guisto, Smith, et al., 199330. m/0.25 mm/0.5 μm, 50. C @ 1. min, 8. K/min, 300. C @ 10. min

References

Guisto, Smith, et al., 1993
Guisto, R.; Smith, S.R.; Stuart, J.D., Gas chromatographic retention indices, mass, and infrared spectra of industrially important adipate esters, J. Chromatogr. Sci., 1993, 31, 6, 225-230, https://doi.org/10.1093/chromsci/31.6.225 . [all data]