9H-Pyrido[3,4-b]indole

Phase change data

Data compiled by: William E. Acree, Jr., James S. Chickos

Enthalpy of fusion

ΔfusH (kJ/mol) Temperature (K) Method Reference
25.5471.5DSCBurrows, Miguel, et al., 1996

Gas phase ion energetics data

Data compiled by: Sharon G. Lias, Rhoda D. Levin, and Sherif A. Kafafi

Ionization energy determinations

IE (eV) Method Reference Comment
7.99 ± 0.06PEDomelsmith and Houk, 1978Vertical value

Van Den Dool and Kratz RI, non-polar column, temperature ramp

View large format table.

Column type Active phase I Reference Comment
CapillaryVF-5MS2009.Todua, 201130. m/0.25 mm/0.25 μm, He; Tstart: 60. C; Tend: 270. C

Normal alkane RI, non-polar column, custom temperature program

View large format table.

Column type Active phase I Reference Comment
CapillaryOV-1, SE-30, Methyl silicone, SP-2100, OV-101, DB-1, etc.2005.Waggott and Davies, 1984Hydrogen; Column length: 50. m; Column diameter: 0.32 mm; Program: not specified

References

Burrows, Miguel, et al., 1996
Burrows, Hugh D.; Miguel, Maria da Graça M.; Varela, A. Paula; Becker, Ralph S., The aqueous solubility and thermal behaviour of some β-carbolines, Thermochimica Acta, 1996, 279, 77-82, https://doi.org/10.1016/S0040-6031(96)90063-5 . [all data]

Domelsmith and Houk, 1978
Domelsmith, L.N.; Houk, K.N., Photoelectron spectroscopic studies of hallucinogens: The use of ionization potentials in QSAR, NIDA Res. Monogr., 1978, 22, 423. [all data]

Todua, 2011
Todua, N.G., Retention Data. NIST Mass Spectrometry Data Center., NIST Mass Spectrometry Data Center, 2011. [all data]

Waggott and Davies, 1984
Waggott, A.; Davies, I.W., Identification of organic pollutants using linear temperature programmed retention indices (LTPRIs) - Part II, 1984, retrieved from http://dwi.defra.gov.uk/research/completed-research/reports/dwi0383.pdf. [all data]