Butanoic acid, 3-methyl-, 2-methylbutyl ester

Normal alkane RI, non-polar column, temperature ramp

Data compiled by: NIST Mass Spectrometry Data Center, William E. Wallace, director

Column type CapillaryCapillaryCapillaryCapillaryCapillary
Active phase HP-5HP-5SLB-5 MSZB-1DB-1
Column length (m) 30.30.30.30.30.
Carrier gas HeliumHydrogenHeliumNitrogenHe
Substrate
Column diameter (mm) 0.2520.250.250.25
Phase thickness (μm) 0.250.250.250.250.25
Tstart (C) 60.70.50.45.50.
Tend (C) 240.290.250.230.220.
Heat rate (K/min) 3.5.3.3.6.
Initial hold (min)   2. 2.
Final hold (min)   10. 20.
I 1107.1109.1107.1089.1094.
ReferenceCavar, Maksimovic, et al., 2010Radulovic, Dordevic, et al., 2010Lo Presti, Sciarrone, et al., 2008Mierendorff, Stahl-Biskup, et al., 2008Audino, Alzogaray, et al., 2007
Comment MSDC-RI MSDC-RI MSDC-RI MSDC-RI MSDC-RI
Column type CapillaryCapillaryCapillaryCapillary
Active phase HP-5HP-5ZB-1OV-1
Column length (m) 30.60.30.183.
Carrier gas H2HeN2N2
Substrate
Column diameter (mm) 0.250.320.250.762
Phase thickness (μm) 0.250.250.25
Tstart (C) 50.30.45.0.
Tend (C) 280.260.230.230.
Heat rate (K/min) 4.2.3.1.
Initial hold (min) 2.2.
Final hold (min) 10.28.
I 1105.1108.71089.1092.
ReferencePino, Sauri-Duch, et al., 2006Leffingwell and Alford, 2005Mierendorff, Stahl-Biskup, et al., 2003Schreyen, Dirinck, et al., 1979
Comment MSDC-RI MSDC-RI MSDC-RI MSDC-RI

Normal alkane RI, polar column, temperature ramp

Data compiled by: NIST Mass Spectrometry Data Center, William E. Wallace, director

Column type CapillaryCapillaryCapillaryCapillary
Active phase CP-Wax 52CBInnowax FSCInnowaxDB-Wax
Column length (m) 30.60.60.60.
Carrier gas HeHeliumHeHe
Substrate
Column diameter (mm)  0.250.250.25
Phase thickness (μm) 0.32  0.25
Tstart (C) 50.60.60.40.
Tend (C) 220.220.220.200.
Heat rate (K/min) 6.4.4.2.
Initial hold (min) 2.10.10.2.
Final hold (min) 20. 10.
I 1334.1286.1299.1295.
ReferenceAudino, Alzogaray, et al., 2007Lourens, Reddy, et al., 2004Suleimenov, Atazharova, et al., 2003Umano, Hagi, et al., 2000
Comment MSDC-RI MSDC-RI MSDC-RI MSDC-RI

Kovats' RI, non-polar column, temperature ramp

Data compiled by: NIST Mass Spectrometry Data Center, William E. Wallace, director

Column type CapillaryPacked
Active phase HP-5MSApiezon L
Column length (m) 30.1.2
Carrier gas He
Substrate  Chromosorb W HMDS HP (00-120 mesh)
Column diameter (mm) 0.25
Phase thickness (μm) 0.25
Tstart (C) 50.50.
Tend (C) 250.200.
Heat rate (K/min) 3.4.
Initial hold (min) 10.
Final hold (min) 5.
I 1110.1071.
ReferenceAsuming, Beauchamp, et al., 2005Rasmussen, 1983
Comment MSDC-RI MSDC-RI

Van Den Dool and Kratz RI, non-polar column, custom temperature program

Data compiled by: NIST Mass Spectrometry Data Center, William E. Wallace, director

Column type CapillaryCapillary
Active phase HP-5MSDB-5
Column length (m) 30.30.
Carrier gas HeHe
Substrate
Column diameter (mm) 0.250.25
Phase thickness (μm) 0.250.25
Program 60C (1 min) => 5 C/min => 210C => 10 C/min => 280C (15 min)50C (1min) => 5C/min => 100C => 10C/min => 250C (9min)
I 1110.21107.
ReferenceAndriamaharavo, 2014Beaulieu and Grimm, 2001
Comment MSDC-RI MSDC-RI

References

Cavar, Maksimovic, et al., 2010
Cavar, S.; Maksimovic, M.; Solic, M.E., Comparison of essential oil composition of Stachys menthufolia Vis. from two natural habitas in Croatia, Biologica Nyssana, 2010, 1, 1-2, 99-103. [all data]

Radulovic, Dordevic, et al., 2010
Radulovic, N.S.; Dordevic, N.D.; Palic, R.M., Volatiles of Pleurospermum austriacum (L.) Hoffm. (Apiaceae), J. Serbian Chem. Soc., 2010, 75, 12, 1-11, https://doi.org/10.2298/JSC100323127R . [all data]

Lo Presti, Sciarrone, et al., 2008
Lo Presti, M.; Sciarrone, D.; Crupi, M.C.; Costa, R.; Ragusa, S.; Dugo, G.; Mondello, L., Evaliation of the volatile and chiral composition in Pistacia lentiscus L. essential oil, Flavour Fragr. J., 2008, 23, 4, 249-257, https://doi.org/10.1002/ffj.1878 . [all data]

Mierendorff, Stahl-Biskup, et al., 2008
Mierendorff, H.-G.; Stahl-Biskup, E.; Posthumus, M.A.; van Beek, T.A., Composition of commercial Cape chamomile oil (Eriocephalus punctuatus / Eriocephalus tenuifolius), 2008, retrieved from http://www.chemische-analysen-hamburg.de/Publikationen?CapeChamomileOil/. [all data]

Audino, Alzogaray, et al., 2007
Audino, P.G.; Alzogaray, R.A.; Vassena, C.; Masuh, H.; Fontán, A.; Gatti, P.; Martínez, A.; Camps, F.; Cork, A.; Zerba, E., Volatile compounds secreted by Brindley's glands of adult Triatoma infestans: identification and biological activity of previously unidentified compounds, Journal of Vector Ecology, 2007, 32, 1, 75-82, https://doi.org/10.3376/1081-1710(2007)32[75:VCSBBO]2.0.CO;2 . [all data]

Pino, Sauri-Duch, et al., 2006
Pino, J.; Sauri-Duch, E.; Marbot, R., Changes in volatile compounds of Habanero chile pepper (Capsicum chinense Jack. cv. Habanero) at two ripening stages, Food Chem., 2006, 94, 3, 394-398, https://doi.org/10.1016/j.foodchem.2004.11.040 . [all data]

Leffingwell and Alford, 2005
Leffingwell, J.C.; Alford, E.D., Volatile constituents of Perique tobacco, Electron. J. Environ. Agric. Food Chem., 2005, 4, 2, 899-915. [all data]

Mierendorff, Stahl-Biskup, et al., 2003
Mierendorff, H.-G.; Stahl-Biskup, E.; Posthumus, M.A.; van Beek, T.A., Composition of commercial Cape chamomile oil (Eriocephalus punctulatus), Flavour Fragr. J., 2003, 18, 6, 510-514, https://doi.org/10.1002/ffj.1259 . [all data]

Schreyen, Dirinck, et al., 1979
Schreyen, L.; Dirinck, P.; Sandra, P.; Schamp, N., Flavor analysis of quince, J. Agric. Food Chem., 1979, 27, 4, 872-876, https://doi.org/10.1021/jf60224a058 . [all data]