Propanoic acid, hexyl ester

Normal alkane RI, polar column, temperature ramp

Data compiled by: NIST Mass Spectrometry Data Center, William E. Wallace, director

Column type CapillaryCapillaryCapillaryCapillary
Active phase DB-WaxSupelcowax-10DB-WaxSupelcowax-10
Column length (m) 30.60.60.90.
Carrier gas HeHeH2He
Substrate
Column diameter (mm) 0.20.250.320.25
Phase thickness (μm)  0.250.250.25
Tstart (C) 50.60.60.35.
Tend (C) 180.280.220.220.
Heat rate (K/min) 3.4.3.2.
Initial hold (min) 8.  20.
Final hold (min)    30.
I 1353.1339.1325.1316.
ReferenceFranco and Shibamoto, 2000Korány, Mednyánszky, et al., 2000Werkhoff, Güntert, et al., 1998Girard and Lau, 1995
Comment MSDC-RI MSDC-RI MSDC-RI MSDC-RI

Normal alkane RI, non-polar column, temperature ramp

Data compiled by: NIST Mass Spectrometry Data Center, William E. Wallace, director

Column type CapillaryCapillary
Active phase HP-5 MSUltra-1
Column length (m) 30.25.
Carrier gas HeliumHe
Substrate
Column diameter (mm) 0.250.32
Phase thickness (μm) 0.250.25
Tstart (C) 40.80.
Tend (C) 250.260.
Heat rate (K/min) 4.3.
Initial hold (min) 2.
Final hold (min) 5.
I 1105.1086.
ReferenceRaffo, Kelderer, et al., 2009Okumura, 1991
Comment MSDC-RI MSDC-RI

Kovats' RI, non-polar column, custom temperature program

Data compiled by: NIST Mass Spectrometry Data Center, William E. Wallace, director

Column type Capillary
Active phase SE-30
Column length (m)
Carrier gas
Substrate
Column diameter (mm)
Phase thickness (μm)
Program not specified
I 1074.
ReferenceChretien and Dubois, 1978
Comment MSDC-RI

References

Franco and Shibamoto, 2000
Franco, M.R.B.; Shibamoto, T., Volatile composition of some Brazilian fruits: umbu-caja (Spondias citherea), camu-camu (Myrciaria dubia), araca-boi (Eugenia stipitata), and cupuacu (Theobroma grandiflorum), J. Agric. Food Chem., 2000, 48, 4, 1263-1265, https://doi.org/10.1021/jf9900074 . [all data]

Korány, Mednyánszky, et al., 2000
Korány, K.; Mednyánszky, Zs.; Amtmann, M., Preliminary results of a recognition method visualizing the aroma and fragrance features, Acta Aliment., 2000, 29, 2, 187-198, https://doi.org/10.1556/AAlim.29.2000.2.9 . [all data]

Werkhoff, Güntert, et al., 1998
Werkhoff, P.; Güntert, M.; Krammer, G.; Sommer, H.; Kaulen, J., Vacuum headspace method in aroma research: flavor chemistry of yellow passion fruits, J. Agric. Food Chem., 1998, 46, 3, 1076-1093, https://doi.org/10.1021/jf970655s . [all data]

Girard and Lau, 1995
Girard, B.; Lau, O.L., Effect of maturity and storage on quality and volatile production of 'Jonagold' apples, Food Res. Int., 1995, 28, 5, 465-471, https://doi.org/10.1016/0963-9969(96)81393-7 . [all data]