Propanoic acid, 2-methyl-, 2-methylbutyl ester

Normal alkane RI, polar column, temperature ramp

Data compiled by: NIST Mass Spectrometry Data Center, William E. Wallace, director

Column type CapillaryCapillaryCapillary
Active phase CP-Wax 52CBInnowaxDB-Wax
Column length (m) 30.60.60.
Carrier gas HeHe
Substrate
Column diameter (mm)  0.250.32
Phase thickness (μm) 0.32
Tstart (C) 50.60.50.
Tend (C) 220.220.250.
Heat rate (K/min) 6.4.4.
Initial hold (min) 2.10.0.1
Final hold (min) 20.10.5.
I 1185.1203.1194.
ReferenceAudino, Alzogaray, et al., 2007Suleimenov, Atazharova, et al., 2003Binder and Flath, 1989
Comment MSDC-RI MSDC-RI MSDC-RI

References

Audino, Alzogaray, et al., 2007
Audino, P.G.; Alzogaray, R.A.; Vassena, C.; Masuh, H.; Fontán, A.; Gatti, P.; Martínez, A.; Camps, F.; Cork, A.; Zerba, E., Volatile compounds secreted by Brindley's glands of adult Triatoma infestans: identification and biological activity of previously unidentified compounds, Journal of Vector Ecology, 2007, 32, 1, 75-82, https://doi.org/10.3376/1081-1710(2007)32[75:VCSBBO]2.0.CO;2 . [all data]

Suleimenov, Atazharova, et al., 2003
Suleimenov, E.M.; Atazharova, G.A.; Demirchi, B.; Baser, K.H.C.; Adekenov, S.M., Essential oil composition of Artemisia Lercheana and A. Sieversiana of Kazakhstan flora in Recent problems of development of new medicines of natural origin, Proceedings of symposium, St.Petersburg - Pushkin, 2003, 382-385. [all data]

Binder and Flath, 1989
Binder, R.G.; Flath, R.A., Volatile components of pineapple guava, J. Agric. Food Chem., 1989, 37, 3, 734-736, https://doi.org/10.1021/jf00087a034 . [all data]