Butane, 1,3-dibromo-3-methyl-

Phase change data

Data compiled by: Robert L. Brown and Stephen E. Stein

Reduced pressure boiling point

Tboil (K) Pressure (atm) Reference
347.70.021Weast and Grasselli, 1989

Reaction thermochemistry data

Data compiled by: Hussein Y. Afeefy, Joel F. Liebman, and Stephen E. Stein

Individual Reactions

Butane, 1,2-dibromo-3-methyl- = Butane, 1,3-dibromo-3-methyl-

By formula: C5H10Br2 = C5H10Br2

Quantity Value Units Method Reference Comment
Δr-2.61 ± 0.07kcal/molEqkAlenin, Nesterova, et al., 1975gas phase

References

Weast and Grasselli, 1989
CRC Handbook of Data on Organic Compounds, 2nd Editon, Weast,R.C and Grasselli, J.G., ed(s)., CRC Press, Inc., Boca Raton, FL, 1989, 1. [all data]

Alenin, Nesterova, et al., 1975
Alenin, V.I.; Nesterova, T.N.; Rozhnov, A.M.; Rasskazova, L.M., Equilibrium of isomerization of dibromoalkanes. V. Isomerization of 3,4-, 2,4-, and 1,4-dibromo-2-methylbutanes, Zh. Fiz. Khim., 1975, 49, 1858. [all data]