2-Bromo-6-methyl-3,9-dihydro-3-[(2-hydroxyethoxy)methyl]-9-oxo-5H-imidazol[1,2-a]pyrine

Phase change data

Data compiled by: William E. Acree, Jr., James S. Chickos

Enthalpy of fusion

ΔfusH (kJ/mol) Temperature (K) Method Reference
50.44474.3DSCZielenkiewicz, Golankiewicz, et al., 1999

References

Zielenkiewicz, Golankiewicz, et al., 1999
Zielenkiewicz, W.; Golankiewicz, B.; Perlovich, G.L.; Kozbial, M., Journal of Solution Chemistry, 1999, 28, 6, 731-745, https://doi.org/10.1023/A:1021720128725 . [all data]