Cyclohexene, 3-chloro-

Normal alkane RI, non-polar column, custom temperature program

Data compiled by: NIST Mass Spectrometry Data Center, William E. Wallace, director

Column type Capillary
Active phase Polydimethyl siloxanes
Column length (m)
Carrier gas
Substrate
Column diameter (mm)
Phase thickness (μm)
Program not specified
I 857.
ReferenceZenkevich, Eliseenkov, et al., 2006
Comment MSDC-RI

Kovats' RI, polar column, isothermal

Data compiled by: NIST Mass Spectrometry Data Center, William E. Wallace, director

Column type Packed
Active phase Carbowax 20M
Column length (m) 1.5
Carrier gas Ar
Substrate Chromosorb W
Column diameter (mm)
Phase thickness (μm)
Temperature (C) 140.
I 1215.
ReferenceSzabó and Jánosi, 1979
Comment MSDC-RI

References

Zenkevich, Eliseenkov, et al., 2006
Zenkevich, I.G.; Eliseenkov, E.V.; Kasatochkin, A.N., Application of Retention Indices in GC-MS Identification of Halogenated Organic Compounds, Mass Spectromery (Rus.), 2006, 3, 2, 131-140. [all data]