trans,trans-2,5-Di-tert-butylcyclohexanol

Reaction thermochemistry data

Data compiled by: Hussein Y. Afeefy, Joel F. Liebman, and Stephen E. Stein

Individual Reactions

trans,trans-2,5-Di-tert-butylcyclohexanol = trans,cis-2,5-Di-tert-butylcyclohexanol

By formula: C14H28O = C14H28O

Quantity Value Units Method Reference Comment
Δr-17.4 ± 1.1kJ/molCmPasto and Rao, 1970liquid phase; solvent: CCl4

cis,Cics-2,5-di-tert-butylcyclohexanol = trans,trans-2,5-Di-tert-butylcyclohexanol

By formula: C14H28O = C14H28O

Quantity Value Units Method Reference Comment
Δr-28.3 ± 1.1kJ/molCmPasto and Rao, 1970liquid phase; solvent: CCl4

trans,trans-2,5-Di-tert-butylcyclohexanol = Cyclohexanol, 2,5-di-tert-butyl-, cis-1,2, trans-1,5

By formula: C14H28O = C14H28O

Quantity Value Units Method Reference Comment
Δr-19.3 ± 1.0kJ/molCmPasto and Rao, 1970liquid phase; solvent: CCl4

References

Pasto and Rao, 1970
Pasto, D.J.; Rao, D.R., Thermodynamic, conformational, and chemical reactivity studies of the 2,5-di-tert-butylcyclohexyl system. Reversal of the thermodynamic stability with chemical reactivity trends of cyclohexyl derivatives, J. Am. Chem. Soc., 1970, 92, 5151-5160. [all data]