Phosphonamidous chloride, N,p-bis(1,1-dimethylethyl)-

Gas phase ion energetics data

Data compiled as indicated in comments:
LBLHLM - Sharon G. Lias, John E. Bartmess, Joel F. Liebman, John L. Holmes, Rhoda D. Levin, and W. Gary Mallard

Ionization energy determinations

IE (eV) Method Reference Comment
8.75PEElbel, Ellis, et al., 1985Vertical value; LBLHLM

References

Elbel, Ellis, et al., 1985
Elbel, S.; Ellis, A.; Niecke, E.; Egsgaard, H.; Carlsen, L., A photoelectron spectroscopic study of di-t-butylphosphazene, J. Chem. Soc. Dalton Trans., 1985, 879. [all data]