[γ-(4-chlorophenyl)-pyridine-2-propyl](dimethyl)ammonium hydrogen (Z)-maleate

Phase change data

Data compiled by: Thermodynamics Research Center, NIST Boulder Laboratories, Chris Muzny director

Quantity Value Units Method Reference Comment
Tfus406.KN/AGrady, Hays, et al., 1973Uncertainty assigned by TRC = 1. K

In addition to the Thermodynamics Research Center (TRC) data available from this site, much more physical and chemical property data is available from the following TRC products:

References

Grady, Hays, et al., 1973
Grady, L.T.; Hays, S.E.; King, R.H.; Klein, H.R.; Mader, W.J.; Wyatt, D.K.; Zimmere, R.O., Drug purity profiles, J. Pharm. Sci., 1973, 62, 459. [all data]