1-Butanol, 2-methyl-, propanoate

Normal alkane RI, polar column, custom temperature program

Data compiled by: NIST Mass Spectrometry Data Center, William E. Wallace, director

Column type CapillaryCapillaryCapillaryCapillaryCapillary
Active phase FFAPFFAPFFAPFFAPHP-FFAP
Column length (m) 50.50.50.50.50.
Carrier gas HeliumHeHeHeHe
Substrate
Column diameter (mm) 0.200.20.20.20.2
Phase thickness (μm) 0.330.330.330.330.33
Program 70 0C (1 min) 3 0C/min -> 142 0C 5 0C/min -> 225 0C (10 min)70C(1min) => 3C/min => 142C => 5C/min => 225C (10min)70C(1min) => 3C/min => 142C => 5C/min => 225C(10min)70C(1min) => 3C/min => 142C => 5C/min => 225C(10min)70C(1min) => 3C/min => 142C => 5C/min => 225C (10min)
I 1180.1199.1199.1199.1199.
ReferenceOrtiz, Echeverra, et al., 2009Lara, Echeverría, et al., 2007Lopez, Villatoro, et al., 2007Echeverría, Correa, et al., 2004Echeverria, Fuentes, et al., 2003
Comment MSDC-RI MSDC-RI MSDC-RI MSDC-RI MSDC-RI

Normal alkane RI, non-polar column, custom temperature program

Data compiled by: NIST Mass Spectrometry Data Center, William E. Wallace, director

Column type Capillary
Active phase BPX-5
Column length (m) 30.
Carrier gas Helium
Substrate
Column diameter (mm) 0.25
Phase thickness (μm) 0.25
Program 70 0C (1 min) 3 0C/min -> 142 0C 5 0C/min -> 225 0C (10 min)
I 950.
ReferenceOrtiz, Echeverra, et al., 2009
Comment MSDC-RI

Van Den Dool and Kratz RI, non-polar column, custom temperature program

Data compiled by: NIST Mass Spectrometry Data Center, William E. Wallace, director

Column type Capillary
Active phase HP-5MS
Column length (m) 30.
Carrier gas He
Substrate
Column diameter (mm) 0.25
Phase thickness (μm) 0.25
Program 60C (1 min) => 5 C/min => 210C => 10 C/min => 280C (15 min)
I 968.4
ReferenceAndriamaharavo, 2014
Comment MSDC-RI

References

Ortiz, Echeverra, et al., 2009
Ortiz, A.; Echeverra, G.; Graell, J.; Lara, I., Calcium dips enhance volatile emission of cold-stored Fuji Kiki-8 apples, J. Agric. Food Chem., 2009, 57, 11, 4931-4938, https://doi.org/10.1021/jf9003576 . [all data]

Lara, Echeverría, et al., 2007
Lara, I.; Echeverría, G.; Graell, J.; López, M.L., Volatile Emission after Controlled Atmosphere Storage of Mondial Gala Apples (Malus domestica): Relationship to Some Involved Enzyme Activities, J. Agric. Food Chem., 2007, 55, 15, 6087-6095, https://doi.org/10.1021/jf070464h . [all data]

Lopez, Villatoro, et al., 2007
Lopez, M.L.; Villatoro, C.; Fuentes, T.; Graell, J.; Lara, I.; Echeverria, G., Volatile compounds, quality parameters and consumer acceptance of 'Pink Lady®' apples stored in different conditions, Postharvest Biol. Technol., 2007, 43, 1, 55-66, https://doi.org/10.1016/j.postharvbio.2006.07.009 . [all data]

Echeverría, Correa, et al., 2004
Echeverría, G.; Correa, E.; Ruiz-Altisent, M.; Graell, J.; Puy, J.; López, L., Characterization of Fuji apples from different harvest dates and storage conditions from measurements of volatiles by gas chromatography and electronic nose, J. Agric. Food Chem., 2004, 52, 10, 3069-3076, https://doi.org/10.1021/jf035271i . [all data]

Echeverria, Fuentes, et al., 2003
Echeverria, G.; Fuentes, M.T.; Graell, J.; Lopez, M.L., Relationships between volatile production, fruit quality and sensory evaluation of Fuji apples stored in different atmospheres by means of multivariate analysis, J. Sci. Food Agric., 2003, 84, 1, 5-20, https://doi.org/10.1002/jsfa.1554 . [all data]