1,6-Octadiene, 3,7-dimethyl-

Normal alkane RI, non-polar column, temperature ramp

Data compiled by: NIST Mass Spectrometry Data Center, William E. Wallace, director

Column type CapillaryCapillary
Active phase BPX-5HP-5
Column length (m)
Carrier gas
Substrate
Column diameter (mm)
Phase thickness (μm)
Tstart (C) 40.35.
Tend (C) 260.200.
Heat rate (K/min) 5.6.
Initial hold (min)  2.
Final hold (min)
I 939.946.
ReferenceDiaz and Kite, 2002Larsen and Frisvad, 1995
Comment MSDC-RI MSDC-RI

Normal alkane RI, non-polar column, custom temperature program

Data compiled by: NIST Mass Spectrometry Data Center, William E. Wallace, director

Column type CapillaryPacked
Active phase SE-30OV-101
Column length (m)  2.5
Carrier gas  N2
Substrate  Chromosorb G 60-80mesh DMCS
Column diameter (mm)
Phase thickness (μm)
Program not specifiednot specified
I 982.946.
ReferenceVinogradov, 2004Swigar and Silverstein, 1981
Comment MSDC-RI MSDC-RI

Van Den Dool and Kratz RI, non-polar column, custom temperature program

Data compiled by: NIST Mass Spectrometry Data Center, William E. Wallace, director

Column type Capillary
Active phase DB-1
Column length (m) 60.
Carrier gas He
Substrate
Column diameter (mm) 0.32
Phase thickness (μm) 1.
Program 35C(5min) => 10C/min => 45C (5min) => 5C/min => 250C (10min)
I 944.
ReferencePlace, Imhof, et al., 2003
Comment MSDC-RI

References

Diaz and Kite, 2002
Diaz, A.; Kite, G.C., A comparison of the pollination ecology of Arum maculatum and A. italicum in England, Watsonia, 2002, 24, 171-181. [all data]

Larsen and Frisvad, 1995
Larsen, T.O.; Frisvad, J.C., Characterization of volatile metabolites from 47 Penicillium taxa, Mycol. Res., 1995, 99, 10, 1153-1166, https://doi.org/10.1016/S0953-7562(09)80271-2 . [all data]