N,N-Dimethylpivalamide

Gas phase ion energetics data

Data evaluated as indicated in comments:
HL - Edward P. Hunter and Sharon G. Lias

Data compiled as indicated in comments:
MM - Michael M. Meot-Ner (Mautner)

Quantity Value Units Method Reference Comment
Proton affinity (review)927.1kJ/molN/AHunter and Lias, 1998HL
Quantity Value Units Method Reference Comment
Gas basicity895.2kJ/molN/AHunter and Lias, 1998HL

Gas basicity at 298K

Gas basicity (review) (kJ/mol) Reference Comment
899. ± 5.Witt and Grutzmacher, 1997Cyclohexylamine. GB lowert limit. Data readjusted to Hunter and Lias, 1998; MM

Condensed phase thermochemistry data

Data compiled by: Hussein Y. Afeefy, Joel F. Liebman, and Stephen E. Stein

Quantity Value Units Method Reference Comment
Δfsolid-81.55 ± 0.50kcal/molCcbAbboud, Jimenez, et al., 1995
Quantity Value Units Method Reference Comment
Δcsolid-1089.2 ± 0.45kcal/molCcbAbboud, Jimenez, et al., 1995

References

Hunter and Lias, 1998
Hunter, E.P.; Lias, S.G., Evaluated Gas Phase Basicities and Proton Affinities of Molecules: An Update, J. Phys. Chem. Ref. Data, 1998, 27, 3, 413-656, https://doi.org/10.1063/1.556018 . [all data]

Witt and Grutzmacher, 1997
Witt, M.; Grutzmacher, H.F., Proton-bound dimers of aliphatic carboxamides: gas-phase basicity and dissociation energy, Int. J. Mass Spectrom. Ion Processes, 1997, 165, 49. [all data]