5,9-Methano-5H-benzocycloheptene,6,9-dihydro-

Gas phase ion energetics data

Data compiled by: Sharon G. Lias, Rhoda D. Levin, and Sherif A. Kafafi

Ionization energy determinations

IE (eV) Method Reference
8.42 ± 0.05PEDomelsmith, Mollere, et al., 1978

References

Domelsmith, Mollere, et al., 1978
Domelsmith, L.N.; Mollere, P.D.; Houk, K.N.; Hahn, R.C.; Johnson, R.P., Photoelectron and charge transfer spectra of benzobicycloalkenes. Relationships between through-space interactions and reactivity, J. Am. Chem. Soc., 1978, 100, 2959. [all data]