2-Acetylthiazole

Normal alkane RI, polar column, custom temperature program

Data compiled by: NIST Mass Spectrometry Data Center, William E. Wallace, director

Column type CapillaryCapillaryCapillaryCapillaryCapillary
Active phase DB-WaxCarbowax 20MSupelcowax-10FFAPFFAP
Column length (m) 60. 60.25.
Carrier gas Helium  He
Substrate
Column diameter (mm) 0.25 0.250.32
Phase thickness (μm) 0.25 0.250.25
Program 60 0C (3 min) 2 0C/min -> 150 0C 4 0C/min -> 200 0Cnot specifiednot specified35C(2min) => 40C/min => 60C(2min) => 6C/min => 230Cnot specified
I 1643.1639.1646.1624.1665.
ReferenceKim. J.H., Ahn, et al., 2004Vinogradov, 2004Baek and Cadwallader, 2003Zehentbauer and Grosch, 1998Blank, Stampfli, et al., 1994
Comment MSDC-RI MSDC-RI MSDC-RI MSDC-RI MSDC-RI

Van Den Dool and Kratz RI, non-polar column, custom temperature program

Data compiled by: NIST Mass Spectrometry Data Center, William E. Wallace, director

Column type CapillaryCapillaryCapillaryCapillaryCapillary
Active phase CP-Sil 8CB-MSDB-5BPX-5BPX-5SE-54
Column length (m) 60.50.50.50.30.
Carrier gas HeHeHeHe
Substrate
Column diameter (mm) 0.250.320.320.320.32
Phase thickness (μm) 0.250.50.50.50.25
Program 0C(5min) => 40C/min => 40C (2min) => 4C/min => 280CoC(5min) => 60C/min => 60C (5min) => 4C/min => 250C0C(5min) => 40C/min => 40C(2min) => 4C/min => 280COC (5min) => 60C/min => 60C(5min) => 4C/min => 250C35C(2min) => 40C/min => 50C(5min) => 6C/min => 230C(15min)
I 1027.1040.1035.1038.1020.
ReferenceElmore, Mottram, et al., 2000Parker, Hassell, et al., 2000Elmore, Mottram, et al., 1999Bredie, Mottram, et al., 1998Hofmann and Schieberle, 1998
Comment MSDC-RI MSDC-RI MSDC-RI MSDC-RI MSDC-RI
Column type CapillaryCapillaryCapillary
Active phase SE-54SE-54DB-5
Column length (m) 30.30.30.
Carrier gas HeHeHe
Substrate
Column diameter (mm) 0.320.320.32
Phase thickness (μm) 0.250.251.0
Program 40C (2min) => 40C/min => 50C (5min) => 6C/min => 230C (15min)40C (2min) => 40C/min => 50C (2min) => 240C (10min)5 0C (0.5 min) -> (1 min) 60 0C (5 min) 4 0C/min -> 250 0C
I 1020.1020.1015.
ReferenceHofmann and Schieberle, 1997Münch, Hofmann, et al., 1997Beal and Mottram, 1994
Comment MSDC-RI MSDC-RI MSDC-RI

References

Kim. J.H., Ahn, et al., 2004
Kim. J.H.; Ahn, H.J.; Yook, H.S.; Kim, K.S.; Rhee, M.S.; Ryu, G.H.; Byun, M.W., Color, flavor, and sensory characteristics of gamma-irradiated salted and fermented anchovy sauce, Radiation Phys. Chem., 2004, 69, 2, 179-187, https://doi.org/10.1016/S0969-806X(03)00400-6 . [all data]

Vinogradov, 2004
Vinogradov, B.A., Production, composition, properties and application of essential oils, 2004, retrieved from http://viness.narod.ru. [all data]

Baek and Cadwallader, 2003
Baek, H.H.; Cadwallader, K.R., Gas chromatographic/olfactometric evaluation of flavor extracts produced from crawfish processing by-products, 2003, retrieved from http://nsgl.gso.uri.edu/source/flsgpw95001/flsgpw95001part5.pdf. [all data]

Zehentbauer and Grosch, 1998
Zehentbauer, G.; Grosch, W., Crust aroma of baguettes. I. Key odorants of baguettes prepared in two different ways, J. Cereal Science, 1998, 28, 1, 81-92, https://doi.org/10.1006/jcrs.1998.0184 . [all data]

Blank, Stampfli, et al., 1994
Blank, I.; Stampfli, A.; Eisenreich, W., Analysis of food flavourings by gas chromatography - olfactometry in Trends of Flavour Research, Maarse, H.; van der Heij, D.G., ed(s)., 1994, 271-276. [all data]