CAS Reg. No. 24265-37-0

Reaction thermochemistry data

Data compiled by: John E. Bartmess

Individual Reactions

(CAS Reg. No. 24265-37-0 • 4294967295C2HF3O) + C2HF3O = CAS Reg. No. 24265-37-0

By formula: (CAS Reg. No. 24265-37-0 • 4294967295C2HF3O) + C2HF3O = CAS Reg. No. 24265-37-0

Quantity Value Units Method Reference Comment
Δr63.9 ± 2.8kcal/molN/ABartmess, Scott, et al., 1979gas phase; value altered from reference due to change in acidity scale

References

Bartmess, Scott, et al., 1979
Bartmess, J.E.; Scott, J.A.; McIver, R.T., Jr., The gas phase acidity scale from methanol to phenol, J. Am. Chem. Soc., 1979, 101, 6047. [all data]