Pyridinebis(acetylacetonato)oxovanadium

Phase change data

Data compiled by: William E. Acree, Jr., James S. Chickos

Enthalpy of sublimation

ΔsubH (kJ/mol) Temperature (K) Method Reference
47.8404.DSCShibutani and Shinra, 1989

References

Shibutani and Shinra, 1989
Shibutani, Yasuhiko; Shinra, Koichiro, Thermal stability of substituted pyridine adducts of bis(acetylacetonato)oxovanadium(IV) in solid state., Bull. Chem. Soc. Jpn., 1989, 62, 5, 1477-1481, https://doi.org/10.1246/bcsj.62.1477 . [all data]