2-Methyl[2.2]paracyclophane

Gas phase ion energetics data

Data compiled as indicated in comments:
LLK - Sharon G. Lias, Rhoda D. Levin, and Sherif A. Kafafi

Ionization energy determinations

IE (eV) Method Reference Comment
7.6PEZhong-zhi, Kovak, et al., 1981LLK
7.90 ± 0.05PEZhong-zhi, Kovak, et al., 1981Vertical value; LLK

References

Zhong-zhi, Kovak, et al., 1981
Zhong-zhi, Y.; Kovak, B.; Heilbronner, E.; Eltamany, S.; Hopf, H., 192. Ionization energies of methyl-substituted [2.2] paracyclophanes, Helv. Chim. Acta, 1981, 64, 1991. [all data]