Oxirane, (butoxymethyl)-

Gas phase thermochemistry data

Data compiled as indicated in comments:
DRB - Donald R. Burgess, Jr.
ALS - Hussein Y. Afeefy, Joel F. Liebman, and Stephen E. Stein

Quantity Value Units Method Reference Comment
Δfgas-291.7 ± 3.0kJ/molN/ASlivinsky, Dolidze, et al., 1993Value computed using ΔfHliquid° value of -345±3 kj/mol from Slivinsky, Dolidze, et al., 1993 and ΔvapH° value of 53.33±0.37 kj/mol from missing citation.; DRB
Δfgas-291.9 ± 2.7kJ/molCcbVan-Chin-Syan and Kachurina, 1987ALS
Δfgas-291.7 ± 3.0kJ/molN/AZaikin, Van Chin Syan, et al., 1972Value computed using ΔfHliquid° value of -345±3 kj/mol from Zaikin, Van Chin Syan, et al., 1972 and ΔvapH° value of 53.33±0.37 kj/mol from missing citation.; DRB

Phase change data

Data compiled as indicated in comments:
BS - Robert L. Brown and Stephen E. Stein
ALS - Hussein Y. Afeefy, Joel F. Liebman, and Stephen E. Stein

Quantity Value Units Method Reference Comment
Tboil438.2KN/AAldrich Chemical Company Inc., 1990BS
Quantity Value Units Method Reference Comment
Δvap53.33 ± 0.37kJ/molVVan-Chin-Syan and Kachurina, 1987ALS

Gas phase ion energetics data

Data compiled by: Sharon G. Lias, John E. Bartmess, Joel F. Liebman, John L. Holmes, Rhoda D. Levin, and W. Gary Mallard

Ionization energy determinations

IE (eV) Method Reference Comment
9.2PERodin, Chistyakov, et al., 1985
9.72PERodin, Chistyakov, et al., 1985Vertical value

References

Slivinsky, Dolidze, et al., 1993
Slivinsky, E.V.; Dolidze, A.V.; Loktev, S.M., Hydroformylation of 2,3- and 2,5-dihydrofurans in the presence of a homogeneous catalytic complex based on dicarbonylrhodium acetylacetonate modified with various phosphites, Neftekhimiya, 1993, 33, 102-113. [all data]

Van-Chin-Syan and Kachurina, 1987
Van-Chin-Syan, Yu.Ya.; Kachurina, N.S., Thermochemical properties of oxirane derivatives, Russ. J. Phys. Chem. (Engl. Transl.), 1987, 61, 622-624. [all data]

Zaikin, Van Chin Syan, et al., 1972
Zaikin, I.; Van Chin Syan, Y.Y.; Chuchmarev, S.K.; Elagin, G.I., Normal heats of formation of some epoxy compounds, Izv. Vyssh. Uchebn. Zaved., Khim. Khim. Tekhnol., 1972, 15, 1193-1195. [all data]