Hydroperoxide, 1-ethylbutyl

Condensed phase thermochemistry data

Data compiled by: Hussein Y. Afeefy, Joel F. Liebman, and Stephen E. Stein

Quantity Value Units Method Reference Comment
Δcliquid-969.6kcal/molCcbPritzkow and Muller, 1956Corresponding Δfliquid = -72.9 kcal/mol (simple calculation by NIST; no Washburn corrections)

Gas phase ion energetics data

Data compiled by: Henry M. Rosenstock, Keith Draxl, Bruce W. Steiner, and John T. Herron

Appearance energy determinations

Ion AE (eV) Other Products MethodReferenceComment
C6H13+9.9 ± 0.1?EIBurgess, SenSharma, et al., 1968
C6H13O+9.3 ± 0.1OHEIBurgess, SenSharma, et al., 1968
C6H13O2+9.6 ± 0.1HEIBurgess, SenSharma, et al., 1968

Normal alkane RI, non-polar column, temperature ramp

View large format table.

Column type Active phase I Reference Comment
CapillaryCP Sil 8 CB965.Facey, Porter, et al., 200530. m/0.25 mm/0.25 μm, He, 80. C @ 5. min, 3. K/min, 200. C @ 5. min

References

Pritzkow and Muller, 1956
Pritzkow, W.; Muller, K.A., Uber die energetische stellung der organischen hydroperoxyde und die o-o-bindungsenergie, Chem. Ber., 1956, 89, 2318-2321. [all data]

Burgess, SenSharma, et al., 1968
Burgess, A.R.; SenSharma, D.K.; White, M.J.D., The mass spectrometry of some alkyl peroxy radicals and related alkyl hydroperoxides, Advan. Mass Spectrom., 1968, 4, 345. [all data]

Facey, Porter, et al., 2005
Facey, P.C.; Porter, R.B.R.; Reese, P.B.; Williams, L.A.D., Biological activity and chemical composition of the essential oil from Jamaican Hyptis verticillata Jacq., J. Agric. Food Chem., 2005, 53, 12, 4774-4777, https://doi.org/10.1021/jf050008y . [all data]