Methyldiallylamine

Phase change data

Data compiled by: Robert L. Brown and Stephen E. Stein

Quantity Value Units Method Reference Comment
Tboil385.KN/APCR Inc., 1990

Gas phase ion energetics data

Data compiled by: Sharon G. Lias, Rhoda D. Levin, and Sherif A. Kafafi

Ionization energy determinations

IE (eV) Method Reference Comment
8.4 ± 0.3PEPeel and Willett, 1977Vertical value

References

PCR Inc., 1990
PCR Inc., Research Chemicals Catalog 1990-1991, PCR Inc., Gainesville, FL, 1990, 1. [all data]

Peel and Willett, 1977
Peel, J.B.; Willett, G.D., Photoelectron spectroscopic studies of the propyl- and allyl- substituted amines, Aust. J. Chem., 1977, 30, 2571. [all data]