Oxirane, [(2-propenyloxy)methyl)-

Gas phase ion energetics data

Data compiled by: Sharon G. Lias, John E. Bartmess, Joel F. Liebman, John L. Holmes, Rhoda D. Levin, and W. Gary Mallard

Ionization energy determinations

IE (eV) Method Reference Comment
8.4PERodin, Chistyakov, et al., 1985
8.96PERodin, Chistyakov, et al., 1985Vertical value

References

Rodin, Chistyakov, et al., 1985
Rodin, A.A.; Chistyakov, A.B.; Sarkisov, Y.S.; Sergeev, Y.L.; V'yunov, K.A.; Golovin, A.V., Electronic structure and geometric structure of three-member J. Heterocycl. Chem.. I. hotoelectron spectra of gylcidyl and thioglycidyl ethers, Russ. J. Phys. Chem., 1985, 59, 444, In original 764. [all data]