[1,1'-Biphenyl]-2-ol, 3-(1,1-dimethylethyl)-

Gas phase thermochemistry data

Data compiled by: Hussein Y. Afeefy, Joel F. Liebman, and Stephen E. Stein

Quantity Value Units Method Reference Comment
Δfgas-57.03kJ/molCcbBertholon, Giray, et al., 1971

Condensed phase thermochemistry data

Data compiled by: Hussein Y. Afeefy, Joel F. Liebman, and Stephen E. Stein

Quantity Value Units Method Reference Comment
Δfliquid-164.kJ/molCcbBertholon, Giray, et al., 1971
Quantity Value Units Method Reference Comment
Δcliquid-8704.4kJ/molCcbBertholon, Giray, et al., 1971Corresponding Δfliquid = -164. kJ/mol (simple calculation by NIST; no Washburn corrections)

Phase change data

Data compiled as indicated in comments:
ALS - Hussein Y. Afeefy, Joel F. Liebman, and Stephen E. Stein
DRB - Donald R. Burgess, Jr.

Quantity Value Units Method Reference Comment
Δvap107.2kJ/molCBertholon, Giray, et al., 1971ALS
Δvap107.0kJ/molN/ABertholon, Giray, et al., 1971DRB

References

Bertholon, Giray, et al., 1971
Bertholon, G.; Giray, M.; Perrin, R.; Vincent-Falquet-Berny, M.F., No. 532. - Etude physicochimique des phenols. OX. - Ethanlpies de combustion et energies de resonance des alcoyl et aryphenols, Bull. Soc. Chim. France, 1971, 3180-3187. [all data]