Pyrazine, 2-methoxy-3-(1-methylpropyl)-

Normal alkane RI, non-polar column, temperature ramp

Data compiled by: NIST Mass Spectrometry Data Center, William E. Wallace, director

Column type CapillaryCapillaryCapillaryCapillaryCapillary
Active phase HP-1BPX-5HP-5HP-5HP-5
Column length (m) 50.25.
Carrier gas HeHe
Substrate
Column diameter (mm) 0.20.22
Phase thickness (μm) 0.50.25
Tstart (C) 60.50.35.35.35.
Tend (C) 250.320.200.200.200.
Heat rate (K/min) 2.5.6.6.6.
Initial hold (min)  5.2.2.2.
Final hold (min) 60.
I 1155.1173.1179.1179.1179.
ReferenceBendimerad and Bendiab, 2005Dickschat, Martens, et al., 2005Larsen and Frisvad, 1995Larsen and Frisvad, 1995Larsen and Frisvad, 1994
Comment MSDC-RI MSDC-RI MSDC-RI MSDC-RI MSDC-RI
Column type CapillaryCapillary
Active phase OV-101DB-5
Column length (m) 50.60.
Carrier gas  H2
Substrate
Column diameter (mm) 0.220.32
Phase thickness (μm)
Tstart (C) 80.40.
Tend (C) 200.200.
Heat rate (K/min) 2.2.
Initial hold (min)
Final hold (min)
I 1159.1162.
ReferenceMihara and Masuda, 1988Gallois and Grimont, 1985
Comment MSDC-RI MSDC-RI

Van Den Dool and Kratz RI, polar column, custom temperature program

Data compiled by: NIST Mass Spectrometry Data Center, William E. Wallace, director

Column type CapillaryCapillaryCapillaryCapillaryCapillary
Active phase DB-WaxDB-WaxDB-WaxDB-WaxFFAP
Column length (m) 30.30.30.30.30.
Carrier gas H2H2  He
Substrate
Column diameter (mm) 0.320.320.250.250.25
Phase thickness (μm) 0.50.50.250.250.25
Program 40C(5min) => 4C/min => 100C6C/min => 136C => 3C/min => 220C (10min)40C(5min) => 4C/min => 100C => 6C/min => 200C20C(30s) => fast => 60C => 4C/min => 220C (20min)20C(30s) => fast => 60C => 4C/min => 220C (20min)35C(2min) => 40C/min => 60C => 6C/min => 180C 20C/min => 240C(10min)
I 1509.1514.1503.1492.1510.
ReferenceEscudero, Campo, et al., 2007Campo, Ferreira, et al., 2005Cantergiani, Brevard, et al., 2001Cantergiani, Brevard, et al., 2001Zimmermann and Schieberle, 2000
Comment MSDC-RI MSDC-RI MSDC-RI MSDC-RI MSDC-RI

Normal alkane RI, non-polar column, custom temperature program

Data compiled by: NIST Mass Spectrometry Data Center, William E. Wallace, director

Column type CapillaryCapillaryCapillaryCapillaryCapillary
Active phase SE-54HP-5HP-5HP-5RTX-5
Column length (m) 30.30.30.30.
Carrier gas HeliumHeHe
Substrate
Column diameter (mm) 0.320.250.250.25
Phase thickness (μm) 0.250.250.250.25
Program 35 0C (2 min) 10 0C/min -> 50 0C (2 min) 6 0C/min -> 250 0C50 C(1min) => 20C/min => 80C => 25C/min => 250C (3 min)50 C(1min) => 20C/min => 80C => 25C/min => 250C (3 min)40C (5min) => 10C/min => 80C => 20C/min => 230C (5min)not specified
I 1175.1176.1180.1180.1175.
ReferenceChristlbauer and Schieberle, 2009Hartmann, 2003Hartmann, 2003Hartmann, McNair, et al., 2002Masanetz, Guth, et al., 1998
Comment MSDC-RI MSDC-RI MSDC-RI MSDC-RI MSDC-RI

References

Bendimerad and Bendiab, 2005
Bendimerad, N.; Bendiab, S.A.T., Composition and antibacterial activity of Pseudocytisus integrifolius (Salisb.) essential oil from Algeria, J. Agric. Food Chem., 2005, 53, 8, 2947-2952, https://doi.org/10.1021/jf047937u . [all data]

Dickschat, Martens, et al., 2005
Dickschat, J.S.; Martens, T.; Brinkhoff, T.; Simon, M.; Schulz, S., Volatiles released by a Streptomyces species isolated from the North Sea, Chemistry and Biodiversity, 2005, 2, 7, 837-865, https://doi.org/10.1002/cbdv.200590062 . [all data]

Larsen and Frisvad, 1995
Larsen, T.O.; Frisvad, J.C., Comparison of different methods for collection of volatile chemical markers from fungi, J. Microbiol. Methods, 1995, 24, 2, 135-144, https://doi.org/10.1016/0167-7012(95)00063-1 . [all data]

Larsen and Frisvad, 1994
Larsen, T.O.; Frisvad, J.C., A simple method for collection of volatile metabolites from fungi based on diffusive sampling from Petri dishes, J. Microbiol. Methods, 1994, 19, 4, 297-305, https://doi.org/10.1016/0167-7012(94)90032-9 . [all data]

Mihara and Masuda, 1988
Mihara, S.; Masuda, H., Structure-odor relationships for disubstituted pyrazines, J. Agric. Food Chem., 1988, 36, 6, 1242-1247, https://doi.org/10.1021/jf00084a029 . [all data]

Gallois and Grimont, 1985
Gallois, A.; Grimont, P.A.D., Pyrazines responsible for the potatolike odor produced by some Serratia and Cedecea strains, Appl. Environ. Microbiol., 1985, 10, 1048-1051. [all data]