Rhodium, dicarbonyl(1,3-diphenyl-1,3-propanedionato-o,o')-

Gas phase ion energetics data

Data compiled by: Sharon G. Lias, Rhoda D. Levin, and Sherif A. Kafafi

Ionization energy determinations

IE (eV) Method Reference
8.4 ± 0.1EIBonati, Distefano, et al., 1971

References

Bonati, Distefano, et al., 1971
Bonati, F.; Distefano, G.; Innorta, G.; Minghetti, G.; Pignataro, S., Ionization energies of rhodium and iridium β-diketonates: on the nature of the last occupied orbital, Z. Anorg. Allg. Chem., 1971, 386, 107. [all data]