1,2,4-Triazine, 3,5,6-trimethyl-

Gas phase ion energetics data

Data compiled as indicated in comments:
LLK - Sharon G. Lias, Rhoda D. Levin, and Sherif A. Kafafi

Ionization energy determinations

IE (eV) Method Reference Comment
8.84PEGleiter, Kobayashi, et al., 1977Vertical value; LLK

References

Gleiter, Kobayashi, et al., 1977
Gleiter, R.; Kobayashi, M.; Neunhoeffer, H.; Spanget-Larsen, J., Photoelectron spectra of 1,2,4-triazine and some methyl derivatives, Chem. Phys. Lett., 1977, 46, 231. [all data]